householdmember,indexnumber,nocontacts,district,subdistrict,gender,age,otherregularincome,hivart,priorhivtest,priorhivtestpos,hivuptake,linkdate,link,linked3m,indexhivresult,indexnum,hivuptakehh,education,artcort,employment,agecat,incomecat,hivuptakeother
01,0006,4-Jan,Limpopo,Greater Tubatse,Male,20,No,refuse HIV test,0,0,no,,,,pos,1975,1,G8-11,0,student,14-24y,<=R1000,1
02,0006,4-Jan,Limpopo,Greater Tubatse,Female,14,No,test neg,0,0,yes,,,,pos,1975,1,G8-11,0,student,14-24y,<=R1000,0
03,0006,4-Jan,Limpopo,Greater Tubatse,Male,16,No,refuse HIV test,0,0,no,,,,pos,1975,1,G8-11,0,student,14-24y,<=R1000,1
01,0007,4-Jan,Limpopo,Greater Tubatse,Male,25,No,test neg,1,0,yes,,,,neg,1976,2,G12,0,unknown,25-39y,<=R1000,1
02,0007,4-Jan,Limpopo,Greater Tubatse,Female,47,No,refuse HIV test,1,0,no,,,,neg,1976,2,G12,0,unknown,40+y,<=R1000,1
03,0007,4-Jan,Limpopo,Greater Tubatse,Male,16,Yes,test neg,0,0,yes,,,,neg,1976,2,Tertiary,0,formal,14-24y,<=R1000,1
01,0008,8-May,Limpopo,Greater Tubatse,Female,23,Yes,test neg,1,0,yes,,,,neg,1977,3,Tertiary,0,formal,14-24y,R1001+,1
02,0008,8-May,Limpopo,Greater Tubatse,Male,36,No,test neg,1,0,yes,,,,neg,1977,3,G12,0,formal,25-39y,R1001+,1
03,0008,8-May,Limpopo,Greater Tubatse,Female,40,No,"sr HIV+, <14oct",1,1,,,,,neg,1977,3,Tertiary,0,no income,40+y,<=R1000,1
04,0008,8-May,Limpopo,Greater Tubatse,Female,36,No,refuse HIV test,0,0,no,,,,neg,1977,3,<=G7,0,grant,25-39y,R1001+,1
05,0008,8-May,Limpopo,Greater Tubatse,Male,18,No,test neg,0,0,yes,,,,neg,1977,3,G8-11,0,student,14-24y,missing,1
03,0010,4-Jan,Limpopo,Greater Tubatse,Female,14,No,refuse HIV test,0,0,no,,,,neg,2046,0,G8-11,0,student,14-24y,missing,0
01,0015,4-Jan,Limpopo,Greater Tubatse,Female,77,Yes,refuse HIV test,0,0,no,,,,pos,1939,0,<=G7,1,grant,40+y,R1001+,0
02,0015,4-Jan,Limpopo,Greater Tubatse,Male,27,Yes,refuse HIV test,1,0,no,,,,pos,1939,0,G8-11,1,formal,25-39y,R1001+,0
01,0027,4-Jan,Limpopo,Greater Tubatse,Female,87,No,refuse HIV test,0,0,no,,,,pos,1979,0,<=G7,0,grant,40+y,R1001+,0
01,0029,4-Jan,Limpopo,Greater Tubatse,Female,24,No,refuse HIV test,1,0,no,,,,unknown,1980,0,G8-11,0,student,14-24y,missing,0
01,0034,4-Jan,Limpopo,Greater Tubatse,Male,22,No,refuse HIV test,1,0,no,,,,pos,2020,0,G12,0,formal,14-24y,R1001+,0
04,0035,4-Jan,Limpopo,Greater Tubatse,Male,27,Yes,refuse HIV test,0,0,no,,,,pos,2021,0,G8-11,0,student,25-39y,missing,0
05,0035,4-Jan,Limpopo,Greater Tubatse,Male,17,Yes,refuse HIV test,1,0,no,,,,pos,2021,0,<=G7,0,student,14-24y,<=R1000,0
06,0035,4-Jan,Limpopo,Greater Tubatse,Male,18,No,refuse HIV test,1,0,no,,,,pos,2021,0,missing,0,unknown,14-24y,<=R1000,0
01,0039,4-Jan,Limpopo,Greater Tubatse,Female,17,No,test neg,1,0,yes,,,,unknown,1981,1,G8-11,0,student,14-24y,missing,0
02,0052,4-Jan,Limpopo,Elias Motswaledi,Male,60,Yes,refuse HIV test,0,0,no,,,,pos,1688,0,<=G7,0,no income,40+y,missing,0
01,0064,4-Jan,Limpopo,Ephraim Mogale,Female,76,No,refuse HIV test,0,0,no,,,,neg,1838,0,<=G7,0,grant,40+y,R1001+,0
01,0080,4-Jan,Limpopo,Elias Motswaledi,Male,70,Yes,refuse HIV test,0,0,no,,,,neg,1734,0,<=G7,0,grant,40+y,R1001+,0
02,0080,4-Jan,Limpopo,Elias Motswaledi,Female,30,Yes,refuse HIV test,0,0,no,,,,neg,1734,0,Tertiary,0,student,25-39y,missing,0
03,0080,4-Jan,Limpopo,Elias Motswaledi,Male,82,Yes,refuse HIV test,1,0,no,,,,neg,1734,0,<=G7,0,grant,40+y,R1001+,0
02,0087,4-Jan,Limpopo,Elias Motswaledi,Female,57,Yes,refuse HIV test,1,0,no,,,,pos,1735,1,G8-11,0,formal,40+y,R1001+,1
03,0087,4-Jan,Limpopo,Elias Motswaledi,Male,60,Yes,refuse HIV test,0,0,no,,,,pos,1735,1,G8-11,0,formal,40+y,R1001+,1
04,0087,4-Jan,Limpopo,Elias Motswaledi,Male,18,Yes,test neg,0,0,yes,,,,pos,1735,1,G8-11,0,student,14-24y,missing,0
05,0087,4-Jan,Limpopo,Elias Motswaledi,Female,20,Yes,refuse HIV test,0,0,no,,,,pos,1735,1,G8-11,0,student,14-24y,missing,1
01,0092,4-Jan,Limpopo,Elias Motswaledi,Female,38,Yes,refuse HIV test,1,0,no,,,,neg,1689,0,<=G7,0,grant,25-39y,<=R1000,0
02,0092,4-Jan,Limpopo,Elias Motswaledi,Female,21,Yes,refuse HIV test,0,0,no,,,,neg,1689,0,<=G7,0,student,14-24y,missing,0
01,0094,4-Jan,Limpopo,Makhudumathamaga,Female,62,No,refuse HIV test,0,0,no,,,,pos,2085,0,missing,1,grant,40+y,R1001+,0
01,0102,4-Jan,Limpopo,Fetakgomo,Female,52,No,refuse HIV test,0,0,no,,,,neg,1903,0,<=G7,0,grant,40+y,<=R1000,0
02,0102,4-Jan,Limpopo,Fetakgomo,Male,14,Yes,refuse HIV test,0,0,no,,,,neg,1903,0,G8-11,0,student,14-24y,missing,0
04,0103,4-Jan,Limpopo,Fetakgomo,Female,27,Yes,test neg,1,0,yes,,,,unknown,1859,1,G12,1,formal,25-39y,<=R1000,0
05,0103,4-Jan,Limpopo,Fetakgomo,Female,68,Yes,refuse HIV test,1,0,no,,,,unknown,1859,1,<=G7,1,grant,40+y,R1001+,1
01,0104,4-Jan,Limpopo,Fetakgomo,Female,20,No,test neg,1,0,yes,,,,pos,1891,1,G8-11,1,grant,14-24y,<=R1000,0
03,0104,4-Jan,Limpopo,Fetakgomo,Female,32,Yes,refuse HIV test,0,0,no,,,,pos,1891,1,<=G7,1,student,25-39y,missing,1
07,0104,4-Jan,Limpopo,Fetakgomo,Female,15,No,refuse HIV test,1,0,no,,,,pos,1891,1,G8-11,1,other income,14-24y,<=R1000,1
01,0106,4-Jan,Limpopo,Fetakgomo,Female,15,No,refuse HIV test,0,0,no,,,,neg,1877,1,G8-11,0,student,14-24y,missing,1
02,0106,4-Jan,Limpopo,Fetakgomo,Female,52,No,test neg,1,0,yes,,,,neg,1877,1,<=G7,0,grant,40+y,<=R1000,0
01,0117,4-Jan,Limpopo,Fetakgomo,Male,60,Yes,test neg,1,0,yes,,,,pos,1861,1,<=G7,1,formal,40+y,R1001+,0
02,0117,4-Jan,Limpopo,Fetakgomo,Female,54,Yes,refuse HIV test,0,0,no,,,,pos,1861,1,<=G7,1,no income,40+y,missing,1
01,0122,4-Jan,Limpopo,Fetakgomo,Male,31,No,refuse HIV test,0,0,no,,,,pos,1892,0,<=G7,1,student,25-39y,missing,0
02,0122,4-Jan,Limpopo,Fetakgomo,Male,20,No,"sr HIV+, <14oct",1,1,,,,,pos,1892,0,G8-11,1,self-employed,14-24y,<=R1000,0
05,0130,4-Jan,Limpopo,Fetakgomo,Female,85,No,refuse HIV test,0,0,no,,,,neg,1863,0,<=G7,0,grant,40+y,R1001+,0
02,0135,4-Jan,Limpopo,Fetakgomo,Male,23,No,refuse HIV test,0,0,no,,,,neg,1918,1,G12,0,student,14-24y,missing,1
03,0135,4-Jan,Limpopo,Fetakgomo,Male,17,No,refuse HIV test,0,0,no,,,,neg,1918,1,G8-11,0,student,14-24y,missing,1
07,0135,4-Jan,Limpopo,Fetakgomo,Female,46,No,test neg,1,0,yes,,,,neg,1918,1,G12,0,formal,40+y,R1001+,0
01,0138,4-Jan,Limpopo,Fetakgomo,Male,31,Yes,refuse HIV test,1,0,no,,,,pos,1904,0,<=G7,1,other income,25-39y,<=R1000,0
01,0139,4-Jan,Limpopo,Fetakgomo,Male,82,Yes,refuse HIV test,0,0,no,,,,neg,1865,1,<=G7,0,grant,40+y,<=R1000,1
02,0139,4-Jan,Limpopo,Fetakgomo,Female,72,Yes,refuse HIV test,0,0,no,,,,neg,1865,1,<=G7,0,grant,40+y,<=R1000,1
05,0139,4-Jan,Limpopo,Fetakgomo,Female,33,Yes,test neg,1,0,yes,,,,neg,1865,1,Tertiary,0,formal,25-39y,R1001+,0
01,0140,4-Jan,Limpopo,Fetakgomo,Male,45,Yes,refuse HIV test,1,0,no,,,,pos,1866,0,G8-11,0,grant,40+y,R1001+,0
01,0141,4-Jan,Limpopo,Fetakgomo,Female,24,Yes,test neg,1,0,yes,,,,neg,1883,1,G8-11,0,grant,14-24y,<=R1000,0
03,0141,4-Jan,Limpopo,Fetakgomo,Female,23,Yes,refuse HIV test,1,0,no,,,,neg,1883,1,G12,0,grant,14-24y,<=R1000,1
05,0141,4-Jan,Limpopo,Fetakgomo,Male,16,Yes,refuse HIV test,0,0,no,,,,neg,1883,1,G8-11,0,student,14-24y,missing,1
01,0143,4-Jan,Limpopo,Fetakgomo,Male,26,No,refuse HIV test,0,0,no,,,,neg,1867,0,G12,0,other income,25-39y,<=R1000,0
01,0149,4-Jan,Limpopo,Fetakgomo,Male,77,Yes,test neg,1,0,yes,,,,unknown,1919,1,<=G7,0,grant,40+y,R1001+,0
03,0149,4-Jan,Limpopo,Fetakgomo,Female,82,Yes,refuse HIV test,0,0,no,,,,unknown,1919,1,<=G7,0,grant,40+y,R1001+,1
01,0163,4-Jan,Limpopo,Makhudumathamaga,Female,55,No,refuse HIV test,1,0,no,,,,pos,2086,0,<=G7,1,self-employed,40+y,<=R1000,0
01,0170,4-Jan,Limpopo,Elias Motswaledi,Female,61,Yes,refuse HIV test,0,0,no,,,,neg,1690,0,<=G7,0,grant,40+y,R1001+,0
02,0170,4-Jan,Limpopo,Elias Motswaledi,Male,66,Yes,refuse HIV test,0,0,no,,,,neg,1690,0,<=G7,0,grant,40+y,R1001+,0
03,0170,4-Jan,Limpopo,Elias Motswaledi,Male,25,Yes,refuse HIV test,1,0,no,,,,neg,1690,0,G12,0,student,25-39y,missing,0
01,0172,4-Jan,Limpopo,Makhudumathamaga,Female,60,No,"sr HIV+, <14oct",1,1,,,,,neg,2228,0,<=G7,0,grant,40+y,R1001+,0
01,0173,4-Jan,Limpopo,Makhudumathamaga,Male,28,No,test neg,0,0,yes,,,,pos,2194,1,G12,1,no income,25-39y,<=R1000,0
03,0173,4-Jan,Limpopo,Makhudumathamaga,Female,30,,refuse HIV test,1,0,no,,,,pos,2194,1,<=G7,1,grant,25-39y,<=R1000,1
04,0173,4-Jan,Limpopo,Makhudumathamaga,Male,15,No,refuse HIV test,0,0,no,,,,pos,2194,1,G8-11,1,grant,14-24y,<=R1000,1
04,0176,4-Jan,Limpopo,Makhudumathamaga,Female,50,No,refuse HIV test,0,0,no,,,,pos,2142,0,G8-11,1,other income,40+y,<=R1000,0
01,0181,4-Jan,Limpopo,Makhudumathamaga,Female,23,No,refuse HIV test,1,0,no,,,,pos,2103,0,G12,1,student,14-24y,<=R1000,0
02,0181,4-Jan,Limpopo,Makhudumathamaga,Female,35,Yes,refuse HIV test,1,0,no,,,,pos,2103,0,G12,1,no income,25-39y,<=R1000,0
01,0189,4-Jan,Limpopo,Elias Motswaledi,Female,74,No,refuse HIV test,0,0,no,,,,unknown,1666,0,<=G7,0,grant,40+y,R1001+,0
02,0189,4-Jan,Limpopo,Elias Motswaledi,Female,43,Yes,refuse HIV test,0,0,no,,,,unknown,1666,0,G8-11,0,grant,40+y,<=R1000,0
03,0189,4-Jan,Limpopo,Elias Motswaledi,Male,48,No,refuse HIV test,1,0,no,,,,unknown,1666,0,G8-11,0,other income,40+y,R1001+,0
04,0189,4-Jan,Limpopo,Elias Motswaledi,Female,20,Yes,refuse HIV test,0,0,no,,,,unknown,1666,0,G8-11,0,student,14-24y,missing,0
01,0190,4-Jan,Limpopo,Elias Motswaledi,Female,71,No,refuse HIV test,0,0,no,,,,neg,1768,0,<=G7,0,grant,40+y,R1001+,0
02,0190,4-Jan,Limpopo,Elias Motswaledi,Male,17,No,refuse HIV test,0,0,no,,,,neg,1768,0,<=G7,0,student,14-24y,missing,0
03,0190,4-Jan,Limpopo,Elias Motswaledi,Female,15,Yes,refuse HIV test,0,0,no,,,,neg,1768,0,<=G7,0,student,14-24y,missing,0
01,0192,8-May,Limpopo,Elias Motswaledi,Female,75,No,refuse HIV test,0,0,no,,,,neg,1667,3,<=G7,0,grant,40+y,R1001+,1
02,0192,8-May,Limpopo,Elias Motswaledi,Male,38,No,test neg,1,0,yes,,,,neg,1667,3,<=G7,0,self-employed,25-39y,R1001+,1
03,0192,8-May,Limpopo,Elias Motswaledi,Male,40,No,refuse HIV test,1,0,no,,,,neg,1667,3,G8-11,0,self-employed,40+y,<=R1000,1
04,0192,8-May,Limpopo,Elias Motswaledi,Female,21,No,test neg,0,0,yes,,,,neg,1667,3,G8-11,0,student,14-24y,missing,1
06,0192,8-May,Limpopo,Elias Motswaledi,Male,16,No,test neg,1,0,yes,,,,neg,1667,3,G8-11,0,student,14-24y,missing,1
07,0192,8-May,Limpopo,Elias Motswaledi,Female,14,No,refuse HIV test,0,0,no,,,,neg,1667,3,G8-11,0,student,14-24y,missing,1
01,0203,4-Jan,Limpopo,Makhudumathamaga,Female,15,Yes,refuse HIV test,1,0,no,,,,pos,2196,1,G8-11,0,formal,14-24y,R1001+,1
02,0203,4-Jan,Limpopo,Makhudumathamaga,Female,39,Yes,test neg,0,0,yes,,,,pos,2196,1,G8-11,0,student,25-39y,<=R1000,0
04,0203,4-Jan,Limpopo,Makhudumathamaga,Female,16,,refuse HIV test,0,0,no,,,,pos,2196,1,<=G7,0,grant,14-24y,<=R1000,1
01,0215,4-Jan,Limpopo,Elias Motswaledi,Female,25,Yes,refuse HIV test,1,0,no,,,,pos,1749,0,G12,1,grant,25-39y,<=R1000,0
03,0225,4-Jan,Limpopo,Makhudumathamaga,Female,68,Yes,test neg,0,0,yes,,,,neg,2144,1,<=G7,0,grant,40+y,R1001+,0
05,0225,4-Jan,Limpopo,Makhudumathamaga,Female,70,Yes,refuse HIV test,0,0,no,,,,neg,2144,1,<=G7,0,grant,40+y,R1001+,1
01,0233,4-Jan,Limpopo,Makhudumathamaga,Female,53,No,refuse HIV test,1,0,no,,,,neg,2104,0,<=G7,0,grant,40+y,<=R1000,0
02,0233,4-Jan,Limpopo,Makhudumathamaga,Female,16,No,refuse HIV test,0,0,no,,,,neg,2104,0,G8-11,0,student,14-24y,<=R1000,0
03,0233,4-Jan,Limpopo,Makhudumathamaga,Male,16,No,refuse HIV test,0,0,no,,,,neg,2104,0,G8-11,0,grant,14-24y,<=R1000,0
01,0237,4-Jan,Limpopo,Elias Motswaledi,Female,42,No,test neg,1,0,yes,,,,neg,1668,3,G8-11,0,grant,40+y,R1001+,1
02,0237,4-Jan,Limpopo,Elias Motswaledi,Male,40,No,test pos,0,0,yes,5/15/2014,0,0,neg,1668,3,G8-11,0,self-employed,40+y,R1001+,1
03,0237,4-Jan,Limpopo,Elias Motswaledi,Female,18,No,test neg,0,0,yes,,,,neg,1668,3,G8-11,0,student,14-24y,missing,1
04,0237,4-Jan,Limpopo,Elias Motswaledi,Male,28,No,refuse HIV test,0,0,no,,,,neg,1668,3,G8-11,0,student,25-39y,missing,1
01,0239,4-Jan,Limpopo,Ephraim Mogale,Female,22,Yes,refuse HIV test,1,0,no,,,,neg,1822,0,G8-11,0,grant,14-24y,<=R1000,0
02,0239,4-Jan,Limpopo,Ephraim Mogale,Female,16,Yes,refuse HIV test,0,0,no,,,,neg,1822,0,<=G7,0,unknown,14-24y,missing,0
05,0239,4-Jan,Limpopo,Ephraim Mogale,Male,16,Yes,refuse HIV test,1,0,no,,,,neg,1822,0,G8-11,0,no income,14-24y,missing,0
06,0239,4-Jan,Limpopo,Ephraim Mogale,Female,18,Yes,"sr HIV+, <14oct",1,1,,,,,neg,1822,0,G12,0,unknown,14-24y,missing,0
01,0240,4-Jan,Limpopo,Elias Motswaledi,Female,51,No,refuse HIV test,1,0,no,,,,neg,1669,0,<=G7,0,no income,40+y,missing,0
01,0254,4-Jan,Limpopo,Makhudumathamaga,Female,29,Yes,test neg,1,0,yes,,,,neg,2145,1,G12,0,no income,25-39y,<=R1000,0
02,0254,4-Jan,Limpopo,Makhudumathamaga,Male,72,No,refuse HIV test,0,0,no,,,,neg,2145,1,<=G7,0,grant,40+y,R1001+,1
04,0254,4-Jan,Limpopo,Makhudumathamaga,Female,70,No,refuse HIV test,0,0,no,,,,neg,2145,1,<=G7,0,grant,40+y,R1001+,1
01,0262,4-Jan,Limpopo,Ephraim Mogale,Female,61,Yes,refuse HIV test,0,0,no,,,,pos,1795,0,<=G7,1,grant,40+y,R1001+,0
02,0264,4-Jan,Limpopo,Ephraim Mogale,Male,16,Yes,refuse HIV test,0,0,no,,,,pos,1796,0,<=G7,0,unknown,14-24y,missing,0
01,0268,4-Jan,Limpopo,Makhudumathamaga,Male,48,Yes,refuse HIV test,1,0,no,,,,pos,2199,0,G8-11,1,formal,40+y,R1001+,0
02,0268,4-Jan,Limpopo,Makhudumathamaga,Female,35,Yes,refuse HIV test,1,0,no,,,,pos,2199,0,G12,1,no income,25-39y,missing,0
05,0268,4-Jan,Limpopo,Makhudumathamaga,Female,16,Yes,refuse HIV test,0,0,no,,,,pos,2199,0,G8-11,1,student,14-24y,missing,0
01,0270,8-May,Limpopo,Elias Motswaledi,Female,16,No,test neg,1,0,yes,,,,pos,1736,2,<=G7,1,grant,14-24y,R1001+,1
02,0270,8-May,Limpopo,Elias Motswaledi,Female,69,Yes,refuse HIV test,1,0,no,,,,pos,1736,2,G8-11,1,student,40+y,missing,1
03,0270,8-May,Limpopo,Elias Motswaledi,Male,14,Yes,refuse HIV test,0,0,no,,,,pos,1736,2,<=G7,1,grant,14-24y,missing,1
04,0270,8-May,Limpopo,Elias Motswaledi,Male,70,Yes,refuse HIV test,0,0,no,,,,pos,1736,2,G8-11,1,unknown,40+y,missing,1
05,0270,8-May,Limpopo,Elias Motswaledi,Male,17,Yes,test neg,0,0,yes,,,,pos,1736,2,G8-11,1,student,14-24y,missing,1
01,0271,4-Jan,Limpopo,Elias Motswaledi,Female,34,Yes,refuse HIV test,1,0,no,,,,neg,1737,0,G8-11,0,grant,25-39y,<=R1000,0
02,0271,4-Jan,Limpopo,Elias Motswaledi,Female,17,No,refuse HIV test,0,0,no,,,,neg,1737,0,G8-11,0,student,14-24y,missing,0
01,0276,4-Jan,Limpopo,Ephraim Mogale,Female,75,Yes,refuse HIV test,0,0,no,,,,neg,1810,0,<=G7,0,grant,40+y,R1001+,0
02,0276,4-Jan,Limpopo,Ephraim Mogale,Female,28,Yes,refuse HIV test,0,0,no,,,,neg,1810,0,G8-11,0,unknown,25-39y,missing,0
03,0276,4-Jan,Limpopo,Ephraim Mogale,Male,17,Yes,refuse HIV test,0,0,no,,,,neg,1810,0,G8-11,0,student,14-24y,missing,0
01,0280,4-Jan,Limpopo,Makhudumathamaga,Female,20,No,test pos,0,0,yes,6/4/2014,0,0,pos,2105,3,G12,0,no income,14-24y,missing,1
02,0280,4-Jan,Limpopo,Makhudumathamaga,Female,24,No,test neg,1,0,yes,,,,pos,2105,3,<=G7,0,grant,14-24y,<=R1000,1
03,0280,4-Jan,Limpopo,Makhudumathamaga,Female,54,No,test neg,1,0,yes,,,,pos,2105,3,G8-11,0,other income,40+y,<=R1000,1
01,0281,4-Jan,Limpopo,Makhudumathamaga,Female,57,No,refuse HIV test,0,0,no,,,,neg,2156,0,<=G7,0,no income,40+y,missing,0
01,0290,4-Jan,Limpopo,Makhudumathamaga,Female,47,Yes,refuse HIV test,0,0,no,,,,neg,2060,0,G8-11,0,grant,40+y,<=R1000,0
03,0290,4-Jan,Limpopo,Makhudumathamaga,Female,21,Yes,refuse HIV test,1,0,no,,,,neg,2060,0,G8-11,0,student,14-24y,missing,0
05,0290,4-Jan,Limpopo,Makhudumathamaga,Male,14,Yes,refuse HIV test,0,0,no,,,,neg,2060,0,G8-11,0,student,14-24y,missing,0
01,0291,4-Jan,Limpopo,Elias Motswaledi,Male,65,Yes,refuse HIV test,1,0,no,,,,pos,1670,0,Tertiary,0,other income,40+y,<=R1000,0
02,0291,4-Jan,Limpopo,Elias Motswaledi,Female,19,Yes,"sr HIV+, <14oct",1,1,,,,,pos,1670,0,G8-11,0,no income,14-24y,missing,0
03,0291,4-Jan,Limpopo,Elias Motswaledi,Male,92,,refuse HIV test,0,0,no,,,,pos,1670,0,<=G7,0,grant,40+y,missing,0
01,0302,4-Jan,Ekurhuleni,Ekurhuleni South,Female,17,Yes,test neg,1,0,yes,,,,pos,1497,2,G12,0,student,14-24y,<=R1000,1
02,0302,4-Jan,Ekurhuleni,Ekurhuleni South,Female,69,Yes,test neg,0,0,yes,,,,pos,1497,2,<=G7,0,grant,40+y,R1001+,1
01,0303,4-Jan,Ekurhuleni,Ekurhuleni South,Female,51,Yes,on ART,1,1,,,,,pos,1220,0,G8-11,0,other income,40+y,<=R1000,0
01,0305,4-Jan,Ekurhuleni,Ekurhuleni South,Male,18,Yes,"sr HIV+, <14oct",1,1,,,,,neg,1498,0,G8-11,0,student,14-24y,<=R1000,0
02,0309,4-Jan,Ekurhuleni,Ekurhuleni South,Female,24,Yes,on ART,1,1,,,,,pos,1499,0,G8-11,0,no income,14-24y,missing,0
03,0309,4-Jan,Ekurhuleni,Ekurhuleni South,Female,15,Yes,refuse HIV test,0,0,no,,,,pos,1499,0,G8-11,0,student,14-24y,missing,0
01,0312,4-Jan,Ekurhuleni,Ekurhuleni South,Female,30,,on ART,1,1,,,,,pos,1500,0,<=G7,0,unknown,25-39y,missing,0
01,0319,8-May,Ekurhuleni,Ekurhuleni South,Female,25,Yes,refuse HIV test,0,0,no,,,,pos,1502,2,G8-11,1,no income,25-39y,missing,1
02,0319,8-May,Ekurhuleni,Ekurhuleni South,Male,26,Yes,refuse HIV test,0,0,no,,,,pos,1502,2,G8-11,1,no income,25-39y,<=R1000,1
03,0319,8-May,Ekurhuleni,Ekurhuleni South,Female,27,Yes,test neg,1,0,yes,,,,pos,1502,2,G8-11,1,no income,25-39y,missing,1
04,0319,8-May,Ekurhuleni,Ekurhuleni South,Female,14,Yes,refuse HIV test,0,0,no,,,,pos,1502,2,G8-11,1,student,14-24y,<=R1000,1
07,0319,8-May,Ekurhuleni,Ekurhuleni South,Male,67,No,test neg,1,0,yes,,,,pos,1502,2,G8-11,1,formal,40+y,R1001+,1
04,0335,8-May,Ekurhuleni,Ekurhuleni South,Female,39,No,on ART,1,1,,,,,pos,1221,2,G12,0,self-employed,25-39y,R1001+,1
05,0335,8-May,Ekurhuleni,Ekurhuleni South,Male,19,Yes,test neg,1,0,yes,,,,pos,1221,2,G8-11,0,no income,14-24y,missing,1
06,0335,8-May,Ekurhuleni,Ekurhuleni South,Female,26,Yes,refuse HIV test,1,0,no,,,,pos,1221,2,G12,0,no income,25-39y,<=R1000,1
07,0335,8-May,Ekurhuleni,Ekurhuleni South,Female,32,Yes,test neg,1,0,yes,,,,pos,1221,2,G12,0,no income,25-39y,<=R1000,1
08,0335,8-May,Ekurhuleni,Ekurhuleni South,Female,70,No,refuse HIV test,0,0,no,,,,pos,1221,2,G8-11,0,grant,40+y,R1001+,1
01,0343,4-Jan,Ekurhuleni,Ekurhuleni South,Female,31,Yes,test neg,1,0,yes,,,,pos,1506,1,G8-11,1,grant,25-39y,<=R1000,0
04,0343,4-Jan,Ekurhuleni,Ekurhuleni South,Female,58,Yes,on ART,1,1,,,,,pos,1506,1,<=G7,1,grant,40+y,<=R1000,1
01,0351,4-Jan,Ekurhuleni,Ekurhuleni East,Female,66,Yes,test neg,0,0,yes,,,,neg,141,1,G8-11,0,grant,40+y,R1001+,0
01,0356,4-Jan,Ekurhuleni,Ekurhuleni East,Female,92,Yes,refuse HIV test,0,0,no,,,,neg,143,0,<=G7,0,grant,40+y,R1001+,0
01,0359,4-Jan,Ekurhuleni,Ekurhuleni East,Female,21,Yes,refuse HIV test,0,0,no,,,,pos,488,1,G12,1,no income,14-24y,missing,1
02,0359,4-Jan,Ekurhuleni,Ekurhuleni East,Male,19,Yes,test neg,0,0,yes,,,,pos,488,1,G8-11,1,student,14-24y,<=R1000,0
01,0361,4-Jan,Ekurhuleni,Ekurhuleni East,Male,29,No,"sr HIV+, <14oct",1,1,,,,,pos,198,1,G8-11,0,other income,25-39y,R1001+,1
02,0361,4-Jan,Ekurhuleni,Ekurhuleni East,Male,27,No,refuse HIV test,1,0,no,,,,pos,198,1,G12,0,formal,25-39y,R1001+,1
03,0361,4-Jan,Ekurhuleni,Ekurhuleni East,Female,17,Yes,test neg,0,0,yes,,,,pos,198,1,G8-11,0,student,14-24y,<=R1000,0
01,0362,4-Jan,Ekurhuleni,Ekurhuleni East,Female,48,No,refuse HIV test,1,0,no,,,,unknown,199,0,G8-11,0,no income,40+y,<=R1000,0
02,0362,4-Jan,Ekurhuleni,Ekurhuleni East,Male,16,Yes,refuse HIV test,0,0,no,,,,unknown,199,0,G8-11,0,student,14-24y,<=R1000,0
01,0371,4-Jan,Ekurhuleni,Ekurhuleni East,Female,58,No,test pos,1,0,yes,6/25/2014,0,0,pos,489,1,<=G7,0,no income,40+y,<=R1000,0
02,0371,4-Jan,Ekurhuleni,Ekurhuleni East,Female,37,Yes,"sr HIV+, <14oct",1,1,,,,,pos,489,1,G8-11,0,no income,25-39y,<=R1000,1
01,0372,8-May,Ekurhuleni,Ekurhuleni East,Male,52,No,refuse HIV test,1,0,no,,,,pos,490,0,G8-11,0,student,40+y,missing,0
02,0372,8-May,Ekurhuleni,Ekurhuleni East,Female,29,No,on ART,1,1,,,,,pos,490,0,G12,0,other income,25-39y,<=R1000,0
03,0372,8-May,Ekurhuleni,Ekurhuleni East,Female,28,No,refuse HIV test,1,0,no,,,,pos,490,0,G8-11,0,grant,25-39y,<=R1000,0
04,0372,8-May,Ekurhuleni,Ekurhuleni East,Female,26,No,refuse HIV test,0,0,no,,,,pos,490,0,<=G7,0,grant,25-39y,<=R1000,0
05,0372,8-May,Ekurhuleni,Ekurhuleni East,Female,15,No,"sr HIV+, <14oct",1,1,,,,,pos,490,0,<=G7,0,other income,14-24y,<=R1000,0
01,0375,4-Jan,Ekurhuleni,Ekurhuleni East,Female,30,Yes,refuse HIV test,1,0,no,,,,pos,491,0,G12,1,no income,25-39y,<=R1000,0
01,0384,4-Jan,Ekurhuleni,Ekurhuleni East,Female,45,Yes,test neg,1,0,yes,,,,pos,20,3,G8-11,0,formal,40+y,<=R1000,1
03,0384,4-Jan,Ekurhuleni,Ekurhuleni East,Female,24,Yes,test neg,1,0,yes,,,,pos,20,3,G8-11,0,student,14-24y,<=R1000,1
05,0384,4-Jan,Ekurhuleni,Ekurhuleni East,Female,16,Yes,test neg,0,0,yes,,,,pos,20,3,G8-11,0,student,14-24y,<=R1000,1
03,0387,4-Jan,Ekurhuleni,Ekurhuleni East,Female,14,Yes,refuse HIV test,1,0,no,,,,pos,466,0,G8-11,1,student,14-24y,<=R1000,0
01,0388,8-May,Ekurhuleni,Ekurhuleni East,Female,40,Yes,refuse HIV test,1,0,no,,,,pos,27,3,G12,0,no income,40+y,missing,1
04,0388,8-May,Ekurhuleni,Ekurhuleni East,Female,16,Yes,test neg,0,0,yes,,,,pos,27,3,G8-11,0,no income,14-24y,<=R1000,1
05,0388,8-May,Ekurhuleni,Ekurhuleni East,Male,45,Yes,refuse HIV test,0,0,no,,,,pos,27,3,<=G7,0,student,40+y,<=R1000,1
06,0388,8-May,Ekurhuleni,Ekurhuleni East,Male,23,Yes,test neg,1,0,yes,,,,pos,27,3,G8-11,0,student,14-24y,<=R1000,1
07,0388,8-May,Ekurhuleni,Ekurhuleni East,Male,16,Yes,test neg,1,0,yes,,,,pos,27,3,Tertiary,0,no income,14-24y,<=R1000,1
08,0388,8-May,Ekurhuleni,Ekurhuleni East,Male,17,Yes,refuse HIV test,0,0,no,,,,pos,27,3,<=G7,0,student,14-24y,<=R1000,1
09,0388,8-May,Ekurhuleni,Ekurhuleni East,Male,17,Yes,refuse HIV test,0,0,no,,,,pos,27,3,G8-11,0,student,14-24y,<=R1000,1
01,0389,4-Jan,Ekurhuleni,Ekurhuleni East,Female,24,No,"sr HIV+, <14oct",1,1,,,,,pos,28,0,<=G7,1,no income,14-24y,<=R1000,0
01,0399,4-Jan,Ekurhuleni,Ekurhuleni East,Female,33,No,test pos,0,0,yes,9/15/2014,1,0,unknown,32,2,G12,0,other income,25-39y,R1001+,1
02,0399,4-Jan,Ekurhuleni,Ekurhuleni East,Male,41,Yes,test neg,0,0,yes,,,,unknown,32,2,G12,0,other income,40+y,<=R1000,1
02,0402,4-Jan,Ekurhuleni,Ekurhuleni South,Male,17,No,refuse HIV test,1,0,no,,,,neg,1337,0,G8-11,0,student,14-24y,<=R1000,0
04,0402,4-Jan,Ekurhuleni,Ekurhuleni South,Female,25,No,refuse HIV test,1,0,no,,,,neg,1337,0,Tertiary,0,student,25-39y,<=R1000,0
01,0405,4-Jan,Ekurhuleni,Ekurhuleni South,Female,59,No,refuse HIV test,1,0,no,,,,pos,1222,0,G8-11,1,no income,40+y,<=R1000,0
03,0406,4-Jan,Ekurhuleni,Ekurhuleni South,Male,16,No,refuse HIV test,1,0,no,,,,pos,1223,0,<=G7,0,grant,14-24y,<=R1000,0
06,0406,4-Jan,Ekurhuleni,Ekurhuleni South,Male,16,No,refuse HIV test,1,0,no,,,,pos,1223,0,G8-11,0,student,14-24y,<=R1000,0
01,0410,4-Jan,Ekurhuleni,Ekurhuleni South,Female,62,Yes,test neg,0,0,yes,,,,pos,1225,1,G8-11,0,grant,40+y,R1001+,0
00,0412,4-Jan,Ekurhuleni,Ekurhuleni South,Male,76,No,refuse HIV test,0,0,no,,,,pos,1338,3,G12,1,grant,40+y,R1001+,1
01,0412,4-Jan,Ekurhuleni,Ekurhuleni South,Male,76,No,test neg,0,0,yes,,,,pos,1338,3,G12,1,grant,40+y,R1001+,1
02,0412,4-Jan,Ekurhuleni,Ekurhuleni South,Male,20,No,test neg,1,0,yes,,,,pos,1338,3,G8-11,1,no income,14-24y,missing,1
03,0412,4-Jan,Ekurhuleni,Ekurhuleni South,Female,50,No,test neg,1,0,yes,,,,pos,1338,3,G8-11,1,no income,40+y,<=R1000,1
01,0415,4-Jan,Ekurhuleni,Ekurhuleni South,Female,21,No,refuse HIV test,0,0,no,,,,pos,1507,0,G8-11,1,grant,14-24y,R1001+,0
01,0418,4-Jan,Ekurhuleni,Ekurhuleni South,Male,64,No,refuse HIV test,0,0,no,,,,pos,1508,0,G8-11,1,grant,40+y,missing,0
03,0418,4-Jan,Ekurhuleni,Ekurhuleni South,Male,46,Yes,refuse HIV test,0,0,no,,,,pos,1508,0,G8-11,1,other income,40+y,R1001+,0
01,0422,4-Jan,Ekurhuleni,Ekurhuleni South,Male,20,Yes,refuse HIV test,0,0,no,,,,pos,1197,0,G8-11,1,no income,14-24y,<=R1000,0
02,0422,4-Jan,Ekurhuleni,Ekurhuleni South,Female,42,Yes,refuse HIV test,0,0,no,,,,pos,1197,0,<=G7,1,no income,40+y,<=R1000,0
03,0422,4-Jan,Ekurhuleni,Ekurhuleni South,Female,19,Yes,refuse HIV test,1,0,no,,,,pos,1197,0,G8-11,1,grant,14-24y,<=R1000,0
01,0424,4-Jan,Ekurhuleni,Ekurhuleni South,Female,21,No,test neg,1,0,yes,,,,unknown,1509,1,G12,0,no income,14-24y,<=R1000,0