trialnox,poc_result_lab,poc_result,sex,ethnic,bmi,hcv_genotype,hiv,vl_enrol,cd4_result,agex,agecat,cen_num,cen_numstr
H1001K,,,Female,White,28.5,1a,No,2055976,,30,30-34,GB019,1
H1002F,,,Female,White,19.700001,1a,No,769275,,30,<30,GB019,1
H1003C,,,Female,White,36.799999,1a,No,6436,,26,<30,GB019,1
H1004Z,,,Male,White,20.9,1a,No,1065474,,36,35-39,GB019,1
H1005W,,,Male,White,27.5,1a,No,90529,,42,40-44,GB019,1
H1006T,,,Male,White,23.299999,1a,No,1782738,,59,55-59,GB019,1
H1007Q,,,Male,White,29.299999,1a,No,7781,,46,45-49,GB019,1
H1009J,,,Female,White,31.4,1a,No,52464,,36,35-39,GB019,1
H1010H,,,Male,White,27.4,1a,No,249097,,36,35-39,GB019,1
H1011D,,,Female,White,20.1,1a,No,35740,,32,30-34,GB019,1
H1012A,,,Male,White,23.299999,1a,No,540011,,40,40-44,GB019,1
H1013X,,,Male,White,22.700001,1a,No,197962,,43,40-44,GB019,1
H1014U,,,Male,White,22.6,1a,No,2322229,,40,35-39,GB019,1
H2001D,,,Male,White,22.200001,1a,No,4225271,,51,50-54,GB022,2
H2002A,IL28 CT,IL28 CT,Male,White,25.799999,1a,No,4262460,,56,55-59,GB022,2
H2003X,,IL28 CT,Male,White,26.299999,1b,No,815784,,37,35-39,GB022,2
H3001B,IL28 TT,IL28 TT,Male,Hispanic/Latino,29.299999,1a,Yes,1661,1157,45,45-49,GB057,3
H3002Y,IL28 CT,IL28 CT,Male,White,24.299999,1a,Yes,4388331,1259,42,40-44,GB057,3
H3003V,,IL28 CT,Female,White,25.200001,1a,Yes,152689,820,54,50-54,GB057,3
H3004S,,IL28 TT,Male,White,27.1,1a,Yes,548857,603,37,35-39,GB057,3
H3005P,,IL28 CT,Male,White,22.5,1a,Yes,2001032,1168,51,50-54,GB057,3
H3006L,,,Male,White,24.5,1a,Yes,700627,991,46,45-49,GB057,3
H4001T,IL28 TT,IL28 TT,Female,White,20.200001,1b,No,21300,,38,35-39,GB080,4
H4002Q,,,Female,White,25,1a,No,4050000,,52,50-54,GB080,4
H4003M,,,Female,White,26.799999,1a,No,7590000,,52,50-54,GB080,4
H5001S,,,Male,White,21,1a,Yes,52619,417,47,45-49,GB091,5
H5003L,,,Male,White,30,1a,Yes,947390,776,43,40-44,GB091,5
H5004H,,,Male,White,22,1a,Yes,501,926,51,50-54,GB091,5
H5005D,,,Male,White,23,1a,Yes,727436,328,60,60+,GB091,5
H5006A,,,Male,White,25,1a,Yes,426580,746,62,60+,GB091,5
H5007X,,,Male,White,26,1a,Yes,575440,969,46,45-49,GB091,5
H5008U,,,Male,White,21,1a,Yes,48978,636,26,<30,GB091,5
H5009R,,,Male,White,20.6,1a,Yes,7943284,900,32,30-34,GB091,5
H5010Q,,,Male,White,20,1a,Yes,537032,207,54,50-54,GB091,5
H6001U,IL28 CT,IL28 CT,Female,White,21.200001,1b,No,810000,,31,30-34,GB095,6
H6002R,,IL28 TT,Male,White,19.6,1a,No,1600000,,54,50-54,GB095,6
H6003N,,IL28 CT,Male,White,33.599998,1b,No,80000,,37,35-39,GB095,6
H6004K,,IL28 CT,Female,White,25.1,1a,No,700000,,65,60+,GB095,6
H6005F,,IL28 CT,Female,Mixed,24.5,1b,No,340000,,29,<30,GB095,6
H6006C,IL28 CT,IL28 CT,Female,Hispanic/Latino,27.299999,1b,No,93000,,55,55-59,GB095,6
H6007Z,IL28 CT,IL28 CT,Female,White,20.299999,1a,No,200000,,44,40-44,GB095,6
H6008W,,IL28 CT,Male,White,27.6,1a,No,7200000,,59,55-59,GB095,6
H6009T,,IL28 CC,Female,Other,35.799999,1b,No,3500000,,42,40-44,GB095,6
H6010S,,,Male,White,35.099998,1a,No,790000,,47,45-49,GB095,6
H6011P,,IL28 CC,Male,White,33,1b,No,40000,,34,30-34,GB095,6
H6012L,,,Female,White,20,1b,No,1400000,,43,40-44,GB095,6
H6013H,,,Male,White,28.700001,1a,No,1300000,,67,60+,GB095,6
H6014D,,IL28 TT,Female,White,28,1b,No,440000,,58,55-59,GB095,6
H6015A,,,Female,Other,30,1a,No,1500000,,60,55-59,GB095,6
H6016X,,IL28 TT,Female,White,24.799999,1b,No,690000,,37,35-39,GB095,6
H6017U,,,Female,White,21,1a,No,390000,,43,40-44,GB095,6
H6018R,IL28 CT,IL28 CT,Male,White,43.400002,1a,No,320000,,40,35-39,GB095,6
H6019N,,,Male,White,27,1a,No,1100000,,54,50-54,GB095,6
H6020M,,IL28 CC,Female,White,28,1a,No,1500000,,50,45-49,GB095,6
H6021J,,IL28 CT,Male,White,22,1b,No,170000,,53,50-54,GB095,6
H6022E,,,Female,White,31,1a,No,210000,,36,35-39,GB095,6
H6023B,,IL28 CC,Female,White,20,1a,No,3000000,,32,30-34,GB095,6
H6024Y,,IL28 CC,Male,White,27,1b,No,800000,,77,60+,GB095,6
H6025V,,,Male,White,29,1a,No,5700000,,41,40-44,GB095,6
H7001B,IL28 CT,IL28 CT,Female,White,24.799999,1a,No,213225,,28,<30,GB103,7
H7002Y,IL28 CC,IL28 CC,Female,SE Asian,25.799999,1b,No,741946,,66,60+,GB103,7
H7003V,IL28 CT,IL28 CT,Female,White,23,1b,No,1607625,,62,60+,GB103,7
H7004S,IL28 CT,IL28 CT,Male,White,28,1a,No,1765581,,40,40-44,GB103,7
H7005P,,IL28 CT,Female,Hispanic/Latino,32.299999,1a,No,372678,,44,40-44,GB103,7
H7007H,IL28 CC,IL28 CC,Male,White,25.5,1b,No,625534,,37,35-39,GB103,7
H7008D,,,Male,White,23.799999,1a,No,257376,,50,45-49,GB103,7
H7009A,IL28 CT,IL28 CT,Male,White,32.599998,1a,No,1009081,,65,60+,GB103,7
H7010Z,,IL28 CC,Female,White,30,1a,No,5960621,,50,50-54,GB103,7
H7011W,,IL28 CT,Male,Hispanic/Latino,37,1b,No,722027,,63,60+,GB103,7
H8001N,,,Female,White,30.799999,1a,No,251273,,43,40-44,GB113,8
H8002K,,,Male,White,23.4,1a,No,247972,,52,50-54,GB113,8
H8003F,,,Female,White,25.200001,1b,No,921552,,28,<30,GB113,8
H8004C,IL28 CT,IL28 CT,Male,White,23.4,1a,Yes,1057185,600,54,50-54,GB113,8
H8005Z,IL28 CC,IL28 CC,Male,Other,26.6,1a,Yes,1128058,879,51,50-54,GB113,8
H8006W,,,Male,White,30.799999,1a,No,1973379,,34,30-34,GB113,8
H8007T,IL28 CT,IL28 CT,Male,White,24.6,1a,Yes,694193,879,62,60+,GB113,8
H8008Q,,,Female,White,22,1a,No,431133,,51,50-54,GB113,8
H8009M,,,Male,White,28.1,1a,No,1015017,,52,50-54,GB113,8
H8010L,,,Female,White,24.5,1a,No,101095,,55,55-59,GB113,8
H8011H,IL28 CT,IL28 CT,Female,White,21.4,1a,No,11243,,62,60+,GB113,8
H8013A,,,Female,White,26.700001,1b,No,1038172,,41,40-44,GB113,8
H8014X,IL28 CC,IL28 CC,Male,White,25.200001,1a,No,609355,,31,30-34,GB113,8
H8015U,,,Male,White,31,1a,No,690182,,51,50-54,GB113,8
H8016R,IL28 TT,IL28 TT,Female,White,19.1,1a,No,1112656,,51,50-54,GB113,8
H8017N,IL28 CC,IL28 CC,Male,White,25,1a,Yes,9703826,1570,45,45-49,GB113,8
H8018K,IL28 TT,IL28 TT,Female,White,25.1,1a,No,178842,,42,40-44,GB113,8
H8019F,,,Male,White,23.299999,1a,No,5447327,,61,60+,GB113,8
H8020E,IL28 TT,IL28 TT,Male,White,31,1a,Yes,4257376,316,44,40-44,GB113,8
H8021B,IL28 CT,IL28 CT,Female,White,25.200001,1a,No,134149,,31,30-34,GB113,8
H8022Y,IL28 CC,IL28 CC,Female,White,22.6,1a,No,5598568,,55,55-59,GB113,8
H8023V,IL28 CC,IL28 CC,Female,White,20.4,1a,No,863667,,40,35-39,GB113,8
H8024S,,,Male,White,31.5,1b,No,286836,,35,30-34,GB113,8
H8025P,IL28 CT,IL28 CT,Male,White,25,1a,No,4653673,,34,30-34,GB113,8
H8026L,,,Male,White,21,1b,No,5410159,,47,45-49,GB113,8
H8027H,IL28 CT,IL28 CT,Male,Black Caribbean/American,48.299999,1a,No,432594,,54,50-54,GB113,8
H8028D,IL28 CT,IL28 CT,Male,White,22,1a,No,2074617,,58,55-59,GB113,8
H8029A,,,Male,White,23.4,1b,No,1872136,,46,45-49,GB113,8
H8030Z,IL28 CT,IL28 CT,Male,White,23.299999,1b,No,83642,,45,45-49,GB113,8
H9001H,IL28 CT,IL28 CT,Male,White,25,1b,No,1850684,,37,35-39,GB142,9
H9002D,IL28 CT,IL28 CT,Female,White,22.299999,1a,No,462938,,52,50-54,GB142,9
H9003A,IL28 CT,IL28 CT,Male,White,29,1a,No,3012865,,29,<30,GB142,9
H9004X,IL28 CT,IL28 CT,Male,White,24.9,1a,No,925875,,59,55-59,GB142,9
H9005U,,,Female,White,20.5,1a,No,164470,,35,35-39,GB142,9
H9006R,IL28 CT,IL28 CT,Female,White,18.9,1b,No,485055,,61,60+,GB142,9
H9007N,,,Female,White,25.299999,1a,No,2327348,,57,55-59,GB142,9
H9008K,IL28 CC,IL28 CC,Male,White,24.1,1a,No,1429752,,46,45-49,GB142,9
H9009F,,,Female,White,22.700001,1b,No,385595,,25,<30,GB142,9
H9010E,IL28 TT,IL28 TT,Male,White,29.299999,1b,No,408504,,65,60+,GB142,9
H9011B,IL28 CT,IL28 CT,Female,White,34.5,1a,No,243757,,55,55-59,GB142,9
H9012Y,IL28 TT,IL28 TT,Female,White,23.299999,1a,No,1400655,,49,45-49,GB142,9
H9013V,IL28 TT,IL28 TT,Male,White,24.9,1a,No,394482,,54,50-54,GB142,9
H9014S,IL28 CT,IL28 CT,Female,White,39.400002,1a,No,445337,,28,<30,GB142,9
H9015P,IL28 CC,IL28 CC,Male,White,27.700001,1a,No,5975256,,53,50-54,GB142,9
H9017H,IL28 CT,IL28 CT,Male,White,29.4,1a,No,1758010,,62,60+,GB142,9
H9018D,IL28 CT,IL28 CT,Female,White,22.700001,1a,No,249335,,33,30-34,GB142,9
H9019A,IL28 CT,IL28 CT,Male,White,23.700001,1a,No,4861428,,58,55-59,GB142,9
H10001L,IL28 CC,IL28 CC,Male,White,25.5,1a,No,2238721,,60,55-59,GB190,10
H10002H,,IL28 CC,Female,White,18.200001,1a,No,7009,,46,45-49,GB190,10
H10004A,,IL28 TT,Male,White,27,1a,No,1949845,,45,40-44,GB190,10
H10005X,IL28 CC,IL28 CC,Male,White,18.4,1a,No,4677351,,40,35-39,GB190,10
H10006U,,IL28 CT,Male,White,25.799999,1a,No,251188,,41,40-44,GB190,10
H10007R,IL28 CC,IL28 CC,Female,White,25.799999,1a,No,194984,,31,30-34,GB190,10
H10008N,,IL28 CT,Female,White,25.799999,1a,No,3162277,,48,45-49,GB190,10
H10009K,,IL28 CT,Male,White,26.4,1a,No,890,,63,60+,GB190,10
H10010J,,IL28 CT,Female,White,27.299999,1a,No,776616,,54,50-54,GB190,10
H10011E,,IL28 TT,Male,White,30.200001,1a,No,885854,,44,40-44,GB190,10
H10012B,,IL28 CT,Male,White,24.299999,1a,No,525856,,42,40-44,GB190,10
H11001B,IL28 TT,IL28 TT,Female,White,21.799999,1b,No,3300000,,57,55-59,GB302,11
H11002Y,No result,No result,Male,White,19.200001,1a,No,590000,,49,45-49,GB302,11
H11003V,IL28 CT,IL28 CT,Female,White,25.700001,1a,No,740000,,39,35-39,GB302,11
H11004S,IL28 CT,IL28 CT,Male,White,21.1,1a,No,2500000,,67,60+,GB302,11
H11005P,,No result,Female,White,27,1a,No,360000,,54,50-54,GB302,11
H11006L,,No result,Male,White,26.700001,1a,No,1100000,,68,60+,GB302,11
H11007H,,IL28 CT,Female,White,25,1b,No,460000,,35,30-34,GB302,11
H11008D,IL28 CC,IL28 CC,Female,Other,25.799999,1a,No,980000,,39,35-39,GB302,11
H11009A,No result,No result,Female,White,32.099998,1a,No,770000,,52,50-54,GB302,11
H11010Z,,,Male,White,27,1a,No,1100000,,44,40-44,GB302,11
H11014M,,,Male,White,32.200001,1a,No,13100000,,41,40-44,GB302,11
H11015J,,No result,Male,White,21,1a,Yes,3220000,858,31,30-34,GB302,11
H12001M,,,Male,Other,24.5,1a,Yes,12349628,878,39,35-39,GB349,12
H12002J,No result,No result,Male,White,21,1a,No,222212,,34,30-34,GB349,12
H12003E,,No result,Male,White,26.1,1a,Yes,324796,696,40,40-44,GB349,12
H12004B,IL28 CC,IL28 CC,Male,White,19.1,1a,Yes,546464,392,65,60+,GB349,12
H12005Y,,,Male,White,24.6,1a,Yes,802065,533,43,40-44,GB349,12
H12006V,,,Male,White,26.9,1b,Yes,905025,1418,49,45-49,GB349,12
H12007S,,,Male,Black Caribbean/American,26.4,1a,Yes,419915,597,47,45-49,GB349,12
H12009L,,IL28 CC,Male,White,19,1a,Yes,2004959,1298,54,50-54,GB349,12
H12010K,IL28 TT,IL28 TT,Male,White,24.700001,1a,Yes,3444058,736,52,50-54,GB349,12
H12011F,No result,No result,Male,Other,22.799999,1a,Yes,403062,1105,32,30-34,GB349,12
H12012C,IL28 CT,IL28 CT,Male,White,23.9,3,No,10004,,44,40-44,GB349,12
H13001D,IL28 CT,IL28 CT,Male,White,25.9,1a,Yes,801000,980,48,45-49,GB420,13
H13002A,IL28 CT,IL28 CT,Male,Black African,21.6,1a,Yes,290000,660,36,35-39,GB420,13
H13003X,IL28 CC,IL28 CC,Male,White,35.400002,1a,Yes,4150000,1020,53,50-54,GB420,13
H13004U,IL28 CC,IL28 CC,Male,White,23.1,1a,Yes,820000,720,44,40-44,GB420,13
H13005R,IL28 CT,IL28 CT,Male,White,23,1a,No,80000,,53,50-54,GB420,13
H13008F,IL28 CT,IL28 CT,Female,White,22.1,1a,No,283000,,47,45-49,GB420,13
H13009C,IL28 CT,IL28 CT,Male,White,22.200001,1a,Yes,1470000,780,49,45-49,GB420,13
H13010B,IL28 CT,IL28 CT,Male,White,18,1a,Yes,439000,700,24,<30,GB420,13
H13011Y,IL28 CT,IL28 CT,Male,White,24.700001,1a,Yes,248000,640,49,45-49,GB420,13
H13012V,IL28 CC,IL28 CC,Male,SE Asian,20.6,1a,Yes,416000,590,34,30-34,GB420,13
H13013S,IL28 CC,IL28 CC,Male,White,26.5,1a,Yes,1480000,680,49,45-49,GB420,13
H13014P,,,Male,White,25.9,1a,No,10700,,40,40-44,GB420,13
H13015L,,,Male,White,30.6,1a,No,17500000,,41,40-44,GB420,13
H13016H,IL28 CT,IL28 CT,Male,Hispanic/Latino,24.4,1a,Yes,105000,730,47,45-49,GB420,13
H13017D,,,Male,White,35,1a,Yes,12900000,490,32,30-34,GB420,13
H13018A,IL28 CC,IL28 CC,Male,Hispanic/Latino,27.6,1a,Yes,77900,1040,39,35-39,GB420,13
H13019X,IL28 CC,IL28 CC,Male,White,25.799999,1a,Yes,2200000,1022,45,40-44,GB420,13
H13020W,IL28 CT,IL28 CT,Female,White,25,1a,No,5190000,,38,35-39,GB420,13
H13021T,,,Male,White,25.200001,1a,Yes,1778279,1100,48,45-49,GB420,13
H13023M,IL28 CT,IL28 CT,Male,White,24.700001,1b,Yes,4897789,740,38,35-39,GB420,13
H13024J,IL28 CC,,Male,White,27.200001,1a,No,9120109,,48,45-49,GB420,13
H13025E,,,Male,White,31.799999,1a,Yes,512861,450,34,30-34,GB420,13
H13026B,IL28 CT,IL28 CT,Male,White,21.799999,1a,Yes,20417380,700,50,50-54,GB420,13
H13027Y,,IL28 TT,Male,White,21.200001,1a,Yes,251189,450,46,45-49,GB420,13
H13028V,IL28 CT,IL28 CT,Male,Black African,27.799999,1a,Yes,19498,300,39,35-39,GB420,13
H13029S,,IL28 CC,Male,White,25.1,1b,Yes,12589250,500,63,60+,GB420,13
H13030R,IL28 CC,IL28 CC,Male,White,21.1,1a,Yes,13182560,490,47,45-49,GB420,13
H13031N,,IL28 CT,Male,White,22.9,1a,No,5248,,40,40-44,GB420,13
H13032K,,IL28 CT,Male,Hispanic/Latino,27.6,1b,Yes,1479109,570,49,45-49,GB420,13
H13033F,,IL28 TT,Male,White,20.4,1a,Yes,831764,290,28,<30,GB420,13
H13035Z,,IL28 CT,Male,White,24.799999,1a,Yes,31623,970,59,55-59,GB420,13
H13036W,,IL28 CC,Male,Other,22,1a,Yes,50119,450,46,45-49,GB420,13
H13037T,,IL28 CC,Male,White,24.700001,1a,Yes,5129,540,43,40-44,GB420,13
H13038Q,IL28 CT,IL28 CT,Male,White,21.700001,1a,Yes,977237,960,57,55-59,GB420,13
H13039M,IL28 CC,IL28 CC,Male,White,26.1,1a,Yes,5370318,770,45,40-44,GB420,13
H13040L,,IL28 CC,Male,White,23.1,1a,Yes,28184,800,34,30-34,GB420,13
H13041H,IL28 CT,IL28 CT,Male,White,25.9,1a,No,1148154,,48,45-49,GB420,13
H13042D,,IL28 TT,Male,White,23.200001,1a,No,28184,,58,55-59,GB420,13
H13043A,IL28 CT,IL28 CT,Male,White,24.5,1a,Yes,602560,550,42,40-44,GB420,13
H13044X,,IL28 CT,Male,Hispanic/Latino,21.799999,1a,Yes,588844,1050,48,45-49,GB420,13
H13045U,,IL28 CT,Male,Hispanic/Latino,20.799999,1a,Yes,85,620,32,30-34,GB420,13
H13046R,IL28 CC,IL28 CC,Female,White,22.200001,1a,No,1230269,,35,30-34,GB420,13
H13047N,IL28 CC,IL28 CC,Male,White,20.9,1a,Yes,3890453,570,39,35-39,GB420,13
H13048K,,IL28 CC,Male,White,21,1a,Yes,288,390,48,45-49,GB420,13
H13049F,,IL28 CC,Male,Hispanic/Latino,22.6,1a,No,10,,39,35-39,GB420,13
H13050E,,IL28 CT,Male,White,20.700001,1a,Yes,2290868,850,27,<30,GB420,13
H13051B,,IL28 CC,Male,White,25.799999,1a,Yes,1174898,440,49,45-49,GB420,13
H13052Y,,IL28 CT,Male,White,23.6,1a,Yes,23988,820,40,40-44,GB420,13
H13053V,,IL28 TT,Male,South Asian,24.299999,3,No,501187,,31,30-34,GB420,13
H13054S,,IL28 CC,Male,White,31.700001,1a,No,5248,,62,60+,GB420,13
H13055P,,IL28 TT,Male,Black Caribbean/American,23.6,1a,Yes,218776,510,48,45-49,GB420,13
H13056L,,,Male,Other,25.5,1b,No,1089549,,30,<30,GB420,13
H14001K,,,Male,White,21.799999,1a,No,6499,,41,40-44,GB544,14
H14002F,,,Female,White,19.4,1a,No,857,,33,30-34,GB544,14
H.008M,,,,,,,,,,,60+,,.
H.004U,,,,,,,,,,,60+,,.
H.007H,,,,,,,,,1631,,60+,,.
H.008D,,,,,,,,,,,60+,,.
H.002P,,,,,,,,,890,,60+,,.
H.006L,,,,,,,,,,,60+,,.
H.012D,,,,,,,,,,,60+,,.
H.016L,,,,,,,,,,,60+,,.
H.008P,,,,,,,,,525,,60+,,.
H.013Z,,,,,,,,,,,60+,,.
H.034C,,,,,,,,,,,60+,,.
