householdid,studyid,rship2head,sex,age,mdaconsent,mdaassent,firstdose,seconddose,thirddose,fstenumdate,subcounty,round,status
HH101000101,HH1010001011,1,1,29,1,,,,,10/14/2016,1,1,
HH101000101,HH10100010110,3,2,0,2,,,,,10/13/2016,1,1,5
HH101000101,HH1010001012,2,2,28,1,,,,,10/14/2016,1,1,
HH101000101,HH1010001013,3,1,7,1,,,,,10/14/2016,1,1,
HH101000101,HH1010001014,3,1,6,1,,,,,10/14/2016,1,1,
HH101000101,HH1010001015,5,1,7,2,,,,,12/12/2016,1,1,5
HH101000101,HH1010001016,3,2,8,1,1,,,,12/12/2016,1,1,5
HH101000101,HH1010001017,3,2,14,1,1,,,,12/12/2016,1,1,5
HH101000101,HH1010001018,3,2,6,2,,,,,10/13/2016,1,1,5
HH101000101,HH1010001019,3,1,2,2,,,,,10/13/2016,1,1,5
HH101000201,HH1010002011,1,1,31,1,,,,,10/14/2016,1,1,
HH101000201,HH1010002012,2,2,20,1,,,,,10/14/2016,1,1,
HH101000201,HH1010002013,3,2,5,1,,,,,10/14/2016,1,1,
HH101000203,HH1010002031,1,2,52,1,,,,,12/12/2016,1,1,
HH101000203,HH1010002032,3,1,15,1,1,,,,12/12/2016,1,1,
HH101000203,HH1010002033,3,1,13,1,1,,,,12/12/2016,1,1,
HH101000301,HH1010003011,1,2,54,1,,,,,10/14/2016,1,1,
HH101000301,HH1010003012,2,2,8,1,,,,,10/14/2016,1,1,
HH101000301,HH1010003013,3,2,14,1,2,,,,10/14/2016,1,1,
HH101000301,HH1010003014,3,1,2,2,,,,,10/14/2016,1,1,99
HH101000302,HH1010003021,3,1,22,2,,,,,10/14/2016,1,1,5
HH101000302,HH1010003022,1,1,30,2,,,,,10/14/2016,1,1,5
HH101000401,HH1010004011,1,1,34,1,,,,,10/14/2016,1,1,
HH101000401,HH1010004012,2,2,35,1,,,,,10/14/2016,1,1,
HH101000401,HH1010004013,3,1,13,1,1,,,,12/12/2016,1,1,
HH101000401,HH1010004014,1,1,22,2,,,,,10/14/2016,1,1,5
HH101000401,HH1010004015,3,1,11,1,1,,,,10/14/2016,1,1,
HH101000401,HH1010004016,3,2,6,1,,,,,10/14/2016,1,1,
HH101000401,HH1010004017,3,2,1,1,,,,,10/14/2016,1,1,
HH101000501,HH1010005011,1,1,68,1,,,,,10/14/2016,1,1,
HH101000501,HH1010005012,2,2,54,1,,,,,10/14/2016,1,1,
HH101000502,HH1010005021,1,1,33,1,,,,,10/14/2016,1,1,
HH101000502,HH1010005022,2,2,22,1,,,,,10/14/2016,1,1,
HH101000502,HH1010005023,3,1,3,1,,,,,10/14/2016,1,1,
HH101000502,HH1010005024,3,1,1,1,,,,,10/14/2016,1,1,
HH101000503,HH1010005031,1,1,18,1,,,,,10/17/2016,1,1,
HH101000503,HH1010005032,8,1,14,1,,,,,10/17/2016,1,1,
HH101000503,HH1010005033,9,1,10,1,1,,,,10/17/2016,1,1,
HH101000503,HH1010005034,8,1,24,1,,,,,10/17/2016,1,1,
HH101000504,HH1010005041,1,2,25,1,,,,,11/05/2016,1,1,
HH101000504,HH1010005042,3,2,1,1,,,,,11/05/2016,1,1,
HH101000601,HH1010006011,1,1,35,1,,,,,10/17/2016,1,1,
HH101000601,HH1010006012,2,2,29,1,,,,,10/17/2016,1,1,
HH101000601,HH1010006013,3,1,10,1,1,,,,10/17/2016,1,1,
HH101000601,HH1010006014,3,2,8,1,1,,,,10/17/2016,1,1,
HH101000601,HH1010006015,3,2,6,1,,,,,10/17/2016,1,1,
HH101000701,HH1010007011,1,1,66,1,,,,,11/05/2016,1,1,
HH101000701,HH1010007012,5,1,17,2,,,,,11/05/2016,1,1,3
HH101000701,HH1010007013,5,1,10,2,2,,,,11/05/2016,1,1,3
HH101000801,HH1010008011,1,1,30,1,,,,,10/17/2016,1,1,
HH101000801,HH1010008012,2,2,27,1,,,,,10/17/2016,1,1,
HH101000801,HH1010008013,3,1,7,1,,,,,10/17/2016,1,1,
HH101000801,HH1010008014,3,1,3,1,,,,,10/17/2016,1,1,
HH101000801,HH1010008015,3,1,0,1,,,,,10/17/2016,1,1,
HH101000803,HH1010008032,8,2,15,2,2,,,,10/17/2016,1,1,5
HH101001001,HH1010010011,1,1,35,1,,,,,10/17/2016,1,1,
HH101001001,HH1010010012,2,2,24,1,,,,,10/17/2016,1,1,
HH101001001,HH1010010013,3,2,6,1,,,,,10/17/2016,1,1,
HH101001001,HH1010010014,3,1,5,1,,,,,10/17/2016,1,1,
HH101001001,HH1010010015,3,1,1,1,,,,,10/17/2016,1,1,
HH101001001,HH1010010016,9,2,10,1,1,,,,12/10/2016,1,1,
HH101001001,HH1010010017,3,2,1,2,,,,,12/10/2016,1,1,99
HH101001101,HH1010011011,1,2,33,1,,,,,10/17/2016,1,1,
HH101001101,HH1010011012,3,1,15,1,1,,,,10/17/2016,1,1,
HH101001101,HH1010011013,3,2,10,1,1,,,,10/17/2016,1,1,
HH101001201,HH1010012011,1,1,55,1,,,,,10/18/2016,1,1,
HH101001201,HH1010012017,3,2,4,2,,,,,,1,1,5
HH101001301,HH1010013011,1,1,73,1,,,,,10/18/2016,1,1,
HH101001301,HH10100130110,5,1,1,1,,,,,10/18/2016,1,1,
HH101001301,HH10100130111,5,2,11,1,1,,,,10/18/2016,1,1,
HH101001301,HH10100130112,4,2,30,1,,,,,10/18/2016,1,1,
HH101001301,HH10100130113,3,2,33,2,,,,,10/18/2016,1,1,
HH101001301,HH1010013012,2,2,65,1,,,,,10/18/2016,1,1,
HH101001301,HH1010013013,3,2,33,1,,,,,10/18/2016,1,1,
HH101001301,HH1010013014,3,1,34,1,,,,,10/18/2016,1,1,
HH101001301,HH1010013015,3,2,21,1,,,,,10/18/2016,1,1,
HH101001301,HH1010013016,5,2,12,1,1,,,,10/18/2016,1,1,
HH101001301,HH1010013017,5,1,8,1,1,,,,10/18/2016,1,1,
HH101001301,HH1010013018,5,2,6,1,,,,,10/18/2016,1,1,
HH101001301,HH1010013019,5,1,6,1,,,,,10/18/2016,1,1,
HH101001401,HH1010014011,1,1,54,1,,,,,10/17/2016,1,1,
HH101001401,HH1010014012,2,2,42,1,,,,,10/17/2016,1,1,
HH101001401,HH1010014013,3,1,20,1,,,,,10/17/2016,1,1,
HH101001401,HH1010014014,3,2,18,1,,,,,10/17/2016,1,1,
HH101001401,HH1010014015,3,2,15,1,1,,,,10/17/2016,1,1,
HH101001401,HH1010014016,3,1,13,1,2,,,,10/17/2016,1,1,
HH101001401,HH1010014017,3,2,8,1,1,,,,10/17/2016,1,1,
HH101001401,HH1010014018,3,2,6,1,,,,,10/17/2016,1,1,
HH101001501,HH1010015011,1,2,75,1,,,,,10/25/2016,1,1,
HH101001501,HH1010015012,4,2,35,1,,,,,10/25/2016,1,1,
HH101001501,HH1010015013,3,1,40,1,,,,,10/25/2016,1,1,
HH101001501,HH1010015014,5,2,8,1,1,,,,10/25/2016,1,1,
HH101001501,HH1010015015,5,1,3,1,,,,,10/25/2016,1,1,
HH101001501,HH1010015016,5,1,1,1,,,,,10/25/2016,1,1,
HH101001601,HH1010016011,1,1,48,1,,,,,10/18/2016,1,1,
HH101001601,HH1010016012,3,1,15,1,1,,,,10/18/2016,1,1,
HH101001602,HH1010016021,1,2,45,1,,,,,10/18/2016,1,1,
HH101001602,HH1010016022,3,2,8,1,1,,,,10/18/2016,1,1,
HH101001602,HH1010016023,3,2,8,1,1,,,,10/18/2016,1,1,
HH101001602,HH1010016024,3,2,6,1,,,,,10/18/2016,1,1,
HH101001602,HH1010016025,3,1,12,1,,,,,10/18/2016,1,1,
HH101001602,HH1010016026,3,1,19,1,,,,,10/18/2016,1,1,
HH101001701,HH1010017011,1,2,40,1,,,,,10/18/2016,1,1,
HH101001701,HH1010017012,3,2,16,1,1,,,,10/18/2016,1,1,
HH101001701,HH1010017013,3,2,14,1,1,,,,10/18/2016,1,1,
HH101001701,HH1010017014,3,2,12,1,,,,,10/18/2016,1,1,
HH101001701,HH1010017015,3,2,4,1,,,,,10/18/2016,1,1,
HH101001701,HH1010017016,3,2,18,1,,,,,10/18/2016,1,1,
HH101001701,HH1010017017,3,1,0,1,,,,,10/18/2016,1,1,
HH101001701,HH1010017018,3,1,19,1,,,,,12/09/2016,1,1,
HH101001901,HH1010019011,1,1,35,1,,,,,10/24/2016,1,1,
HH101001901,HH1010019012,2,2,30,1,,,,,10/24/2016,1,1,
HH101001901,HH1010019013,3,2,11,1,1,,,,10/24/2016,1,1,
HH101001901,HH1010019014,3,2,8,1,1,,,,10/24/2016,1,1,
HH101001901,HH1010019015,3,1,6,1,,,,,10/24/2016,1,1,
HH101001901,HH1010019016,3,1,5,1,,,,,10/24/2016,1,1,
HH101001901,HH1010019017,3,1,3,1,,,,,10/24/2016,1,1,
HH101001901,HH1010019018,3,1,2,1,,,,,10/24/2016,1,1,
HH101002001,HH1010020011,1,1,28,1,,,,,10/18/2016,1,1,
HH101002001,HH1010020012,2,2,20,1,,,,,10/18/2016,1,1,
HH101002001,HH1010020013,4,2,5,1,,,,,10/18/2016,1,1,
HH101002001,HH1010020014,3,1,3,1,,,,,10/18/2016,1,1,
HH101002001,HH1010020015,3,2,0,1,,,,,10/18/2016,1,1,
HH101002101,HH1010021011,1,2,48,1,,,,,10/18/2016,1,1,
HH101002101,HH1010021012,3,2,14,1,1,,,,10/18/2016,1,1,
HH101002101,HH1010021013,3,1,11,1,1,,,,10/18/2016,1,1,
HH101002201,HH1010022011,1,1,25,1,,,,,10/18/2016,1,1,
HH101002201,HH1010022012,2,2,23,1,,,,,10/18/2016,1,1,
HH101002201,HH1010022013,3,2,2,1,,,,,10/18/2016,1,1,
HH101002301,HH1010023011,1,1,31,1,,,,,10/21/2016,1,1,
HH101002301,HH1010023012,2,2,29,1,,,,,10/21/2016,1,1,
HH101002301,HH1010023013,3,1,11,1,,,,,10/21/2016,1,1,
HH101002301,HH1010023014,3,2,9,1,,,,,10/21/2016,1,1,
HH101002301,HH1010023015,3,2,6,1,,,,,10/21/2016,1,1,
HH101002401,HH1010024011,1,2,86,1,,,,,10/20/2016,1,1,
HH101002501,HH1010025011,1,1,48,1,,,,,10/20/2016,1,1,
HH101002501,HH10100250110,3,2,5,1,,,,,10/20/2016,1,1,
HH101002501,HH10100250111,6,2,80,1,,,,,10/20/2016,1,1,
HH101002501,HH1010025012,2,2,40,1,,,,,10/20/2016,1,1,
HH101002501,HH1010025013,3,1,21,1,,,,,10/20/2016,1,1,
HH101002501,HH1010025014,3,1,18,1,,,,,10/20/2016,1,1,
HH101002501,HH1010025015,3,1,15,1,1,,,,10/20/2016,1,1,
HH101002501,HH1010025016,3,1,13,1,1,,,,10/20/2016,1,1,
HH101002501,HH1010025017,3,1,11,1,1,,,,10/20/2016,1,1,
HH101002501,HH1010025018,3,1,9,1,1,,,,10/20/2016,1,1,
HH101002501,HH1010025019,3,1,7,1,,,,,10/20/2016,1,1,
HH101002601,HH1010026011,1,1,56,1,,,,,10/20/2016,1,1,
HH101002601,HH1010026012,2,2,46,1,,,,,10/20/2016,1,1,
HH101002601,HH1010026013,3,1,22,1,,,,,10/20/2016,1,1,
HH101002601,HH1010026014,3,1,20,1,,,,,10/20/2016,1,1,
HH101002601,HH1010026015,3,2,16,1,1,,,,10/20/2016,1,1,
HH101002601,HH1010026016,3,2,14,1,1,,,,10/20/2016,1,1,
HH101002601,HH1010026017,3,2,24,1,,,,,10/20/2016,1,1,
HH101002601,HH1010026018,5,1,6,1,,,,,10/20/2016,1,1,
HH101002601,HH1010026019,5,2,3,1,,,,,10/20/2016,1,1,
HH101002801,HH1010028011,1,1,44,1,,,,,10/20/2016,1,1,
HH101002801,HH1010028012,2,2,30,1,,,,,10/20/2016,1,1,
HH101002801,HH1010028013,3,2,13,1,1,,,,10/20/2016,1,1,
HH101002801,HH1010028014,3,1,11,1,1,,,,10/20/2016,1,1,
HH101002801,HH1010028015,3,2,8,1,1,,,,10/20/2016,1,1,
HH101002801,HH1010028016,3,1,4,1,,,,,10/20/2016,1,1,
HH101002801,HH1010028017,3,2,0,1,,,,,10/20/2016,1,1,
HH101002901,HH1010029011,1,2,71,1,,,,,10/20/2016,1,1,
HH101003001,HH1010030011,1,2,50,1,,,,,10/21/2016,1,1,
HH101003001,HH10100300110,4,2,22,1,,,,,10/20/2016,1,1,
HH101003001,HH10100300111,5,2,4,1,,,,,10/20/2016,1,1,
HH101003001,HH10100300112,5,1,1,1,,,,,10/20/2016,1,1,
HH101003001,HH10100300113,5,2,7,1,,,,,11/28/2016,1,1,
HH101003001,HH10100300114,5,2,4,1,,,,,11/28/2016,1,1,
HH101003001,HH1010030012,3,1,25,1,,,,,10/20/2016,1,1,
HH101003001,HH1010030013,3,1,22,1,,,,,10/20/2016,1,1,
HH101003001,HH1010030014,3,2,20,1,,,,,10/20/2016,1,1,
HH101003001,HH1010030015,3,2,18,1,,,,,10/20/2016,1,1,
HH101003001,HH1010030016,3,2,16,1,1,,,,10/20/2016,1,1,
HH101003001,HH1010030017,3,2,10,1,1,,,,10/20/2016,1,1,
HH101003001,HH1010030018,5,2,1,1,,,,,10/20/2016,1,1,
HH101003001,HH1010030019,5,1,1,1,,,,,10/20/2016,1,1,
HH101003002,HH1010030021,1,1,50,1,,,,,11/28/2016,1,1,
HH101003002,HH10100300212,3,2,1,2,,,,,,1,1,
HH101003002,HH1010030025,3,2,20,2,,,,,,1,1,
HH101003002,HH1010030026,3,1,24,2,,,,,,1,1,
HH101003101,HH1010031011,1,2,51,1,,,,,11/28/2016,1,1,
HH101003101,HH10100310110,5,1,9,1,,,,,11/28/2016,1,1,
HH101003101,HH10100310111,5,2,4,1,,,,,11/28/2016,1,1,
HH101003101,HH1010031012,3,2,30,1,,,,,11/28/2016,1,1,
HH101003101,HH1010031013,3,2,22,1,,,,,11/28/2016,1,1,
HH101003101,HH1010031014,3,1,18,1,,,,,11/28/2016,1,1,
HH101003101,HH1010031015,3,1,16,1,,,,,11/28/2016,1,1,
HH101003101,HH1010031016,3,1,11,1,,,,,11/28/2016,1,1,
HH101003101,HH1010031017,5,2,3,1,,,,,11/28/2016,1,1,
HH101003101,HH1010031018,4,2,19,1,,,,,11/28/2016,1,1,
HH101003101,HH1010031019,5,1,12,1,,,,,11/28/2016,1,1,
HH101003201,HH1010032011,1,1,54,1,,,,,10/21/2016,1,1,
HH101003201,HH10100320110,9,1,50,1,,,,,10/21/2016,1,1,
HH101003201,HH10100320111,9,2,12,1,1,,,,12/10/2016,1,1,5
HH101003201,HH1010032012,2,2,47,1,,,,,10/21/2016,1,1,
HH101003201,HH1010032013,3,1,23,1,,,,,10/21/2016,1,1,
HH101003201,HH1010032014,3,2,19,1,,,,,10/21/2016,1,1,
HH101003201,HH1010032015,3,1,17,1,2,,,,10/21/2016,1,1,
HH101003201,HH1010032016,3,2,16,1,1,,,,10/21/2016,1,1,
HH101003201,HH1010032017,3,1,14,1,1,,,,10/21/2016,1,1,
HH101003201,HH1010032018,3,1,12,1,1,,,,10/21/2016,1,1,
HH101003201,HH1010032019,3,2,9,1,,,,,10/21/2016,1,1,
HH101003302,HH1010033021,1,1,43,1,,,,,11/28/2016,1,1,
HH101003302,HH10100330210,3,2,3,1,,,,,11/28/2016,1,1,
HH101003302,HH1010033022,2,2,38,1,,,,,11/28/2016,1,1,
HH101003302,HH1010033023,3,1,18,1,,,,,11/28/2016,1,1,
HH101003302,HH1010033024,3,1,12,1,1,,,,11/28/2016,1,1,
HH101003302,HH1010033025,3,1,11,1,,,,,11/28/2016,1,1,
HH101003302,HH1010033026,3,1,14,1,1,,,,11/28/2016,1,1,
HH101003302,HH1010033027,3,1,8,1,1,,,,11/28/2016,1,1,
HH101003302,HH1010033028,3,1,6,1,,,,,11/28/2016,1,1,
HH101003302,HH1010033029,3,1,6,1,,,,,11/28/2016,1,1,
HH101003401,HH1010034011,1,1,30,1,,,,,10/22/2016,1,1,
HH101003401,HH1010034012,2,2,23,1,,,,,10/22/2016,1,1,
HH101003401,HH1010034013,3,2,4,1,,,,,10/22/2016,1,1,
HH101003501,HH1010035011,1,1,26,1,,,,,10/22/2016,1,1,
HH101003501,HH1010035012,2,2,22,1,,,,,10/22/2016,1,1,
HH101003501,HH1010035013,3,1,1,1,,,,,10/22/2016,1,1,
HH101003501,HH1010035014,9,2,65,1,,,,,10/22/2016,1,1,
HH101003501,HH1010035017,3,2,3,2,,,,,,1,1,
HH101003701,HH1010037011,1,1,25,1,,,,,10/24/2016,1,1,
HH101003701,HH1010037012,2,2,21,1,,,,,10/24/2016,1,1,
HH101003701,HH1010037013,3,1,7,1,,,,,10/24/2016,1,1,
HH101003701,HH1010037014,3,2,3,1,,,,,10/24/2016,1,1,
HH101003801,HH1010038011,1,1,22,1,,,,,10/24/2016,1,1,
HH101003801,HH1010038012,2,2,19,1,,,,,10/24/2016,1,1,
HH101003801,HH1010038013,8,1,16,1,1,,,,10/24/2016,1,1,
HH101003801,HH1010038014,8,1,14,1,1,,,,10/24/2016,1,1,
HH101003801,HH1010038015,3,1,0,1,,,,,10/24/2016,1,1,
HH101003901,HH1010039011,1,1,33,1,,,,,10/24/2016,1,1,
HH101003901,HH1010039012,2,2,27,1,,,,,10/24/2016,1,1,
HH101003901,HH1010039013,3,2,11,1,1,,,,10/24/2016,1,1,
HH101003901,HH1010039014,3,1,9,1,1,,,,10/24/2016,1,1,
HH101003901,HH1010039015,3,2,4,1,,,,,10/24/2016,1,1,
HH101003901,HH1010039016,3,2,1,1,,,,,10/24/2016,1,1,
HH101004001,HH1010040011,1,2,30,1,,,,,10/24/2016,1,1,
HH101004001,HH1010040012,3,2,17,1,1,,,,10/24/2016,1,1,
HH101004001,HH1010040013,3,1,15,1,1,,,,10/24/2016,1,1,
HH101004001,HH1010040014,3,1,13,1,1,,,,10/24/2016,1,1,
HH101004001,HH1010040015,3,1,8,1,1,,,,10/24/2016,1,1,
HH101004001,HH1010040016,3,1,4,1,,,,,10/24/2016,1,1,
HH101004001,HH1010040017,3,1,2,1,,,,,10/24/2016,1,1,
HH101004001,HH1010040018,3,2,0,1,,,,,10/24/2016,1,1,
HH101004101,HH1010041011,1,1,64,1,,,,,,1,1,
HH101004101,HH1010041012,2,2,52,1,,,,,,1,1,
HH101004101,HH1010041013,3,1,23,1,,,,,,1,1,
HH101004101,HH1010041014,3,1,19,1,,,,,,1,1,
HH101004101,HH1010041015,3,2,13,1,1,,,,,1,1,
HH101004102,HH1010041021,1,1,26,1,,,,,,1,1,
HH101004102,HH1010041022,2,2,22,1,,,,,,1,1,
HH101004102,HH1010041023,3,2,3,1,,,,,,1,1,
HH101004102,HH1010041024,3,1,0,1,,,,,,1,1,
HH101004201,HH1010042011,1,1,55,1,,,,,,1,1,
HH101004201,HH1010042012,2,2,46,1,,,,,,1,1,
HH101004201,HH1010042013,3,1,22,1,,,,,,1,1,
HH101004201,HH1010042014,3,2,17,1,1,,,,,1,1,
HH101004201,HH1010042015,3,1,13,1,1,,,,,1,1,
HH101004201,HH1010042016,3,2,7,1,,,,,,1,1,
HH101004201,HH1010042017,5,2,0,1,,,,,,1,1,
HH101004201,HH1010042018,3,2,10,1,,,,,11/29/2016,1,1,
HH101004301,HH1010043011,1,2,67,1,,,,,,1,1,
HH101004401,HH1010044011,1,1,60,1,,,,,,1,1,
HH101004401,HH10100440110,3,1,5,1,,,,,,1,1,
HH101004401,HH10100440111,3,1,2,2,,,,,12/10/2016,1,1,
HH101004401,HH10100440112,3,2,1,2,,,,,12/10/2016,1,1,
HH101004401,HH1010044012,2,2,45,1,,,,,,1,1,
HH101004401,HH1010044013,3,2,22,1,,,,,,1,1,
HH101004401,HH1010044014,3,2,20,1,,,,,,1,1,
HH101004401,HH1010044015,3,1,18,1,,,,,,1,1,
HH101004401,HH1010044016,3,1,16,1,1,,,,,1,1,
HH101004401,HH1010044017,3,2,14,1,1,,,,,1,1,
HH101004401,HH1010044018,3,2,9,1,1,,,,,1,1,
HH101004401,HH1010044019,3,2,7,1,,,,,,1,1,
HH101004501,HH1010045011,1,2,31,1,,,,,,1,1,
HH101004501,HH1010045013,3,2,19,1,,,,,,1,1,
HH101004501,HH1010045014,3,1,14,1,1,,,,,1,1,
HH101004501,HH1010045015,3,2,7,1,,,,,,1,1,
HH101004501,HH1010045016,3,1,3,1,,,,,,1,1,
HH101004501,HH1010045017,3,2,4,1,,,,,,1,1,
HH101004501,HH1010045018,3,1,2,1,,,,,,1,1,
HH101004602,HH1010046021,1,1,66,1,,,,,11/29/2016,1,1,
HH101004602,HH10100460210,3,2,13,2,1,,,,12/10/2016,1,1,
HH101004602,HH10100460211,3,1,13,2,,,,,12/10/2016,1,1,
HH101004602,HH1010046022,2,2,62,1,,,,,11/29/2016,1,1,
HH101004602,HH1010046023,3,1,23,1,,,,,11/29/2016,1,1,
HH101004602,HH1010046024,3,2,17,1,1,,,,11/29/2016,1,1,
HH101004602,HH1010046025,5,1,0,1,,,,,11/29/2016,1,1,
HH101004602,HH1010046027,5,1,0,2,,,,,12/11/2016,1,1,
HH101004602,HH1010046028,5,2,2,2,,,,,12/10/2016,1,1,
HH101004602,HH1010046029,3,2,60,2,,,,,12/10/2016,1,1,
HH101004701,HH1010047011,1,1,60,1,,,,,,1,1,
HH101004701,HH1010047012,2,2,35,1,,,,,,1,1,
HH101004701,HH1010047013,3,2,15,1,1,,,,,1,1,
HH101004701,HH1010047014,3,1,14,1,1,,,,,1,1,
HH101004701,HH1010047015,3,2,10,1,1,,,,,1,1,
HH101004701,HH1010047016,3,2,8,1,1,,,,,1,1,
HH101004701,HH1010047017,3,1,5,1,,,,,,1,1,
HH101004701,HH1010047018,3,2,3,1,,,,,,1,1,
HH101004701,HH1010047019,3,1,0,1,,,,,,1,1,
HH101004801,HH1010048011,1,1,20,1,,,,,,1,1,
HH101004801,HH10100480110,6,1,70,2,,,,,12/12/2016,1,1,
HH101004801,HH1010048012,6,2,49,1,,,,,,1,1,
HH101004801,HH1010048013,8,1,26,1,,,,,,1,1,
HH101004801,HH1010048014,8,1,16,1,1,,,,,1,1,
HH101004801,HH1010048015,8,1,13,1,1,,,,,1,1,
HH101004801,HH1010048016,8,1,12,1,1,,,,,1,1,
HH101004801,HH1010048017,8,1,10,1,1,,,,,1,1,
HH101004801,HH1010048018,3,2,18,2,,,,,12/12/2016,1,1,
HH101004801,HH1010048019,2,2,22,2,,,,,,1,1,5
HH101004901,HH1010049011,1,1,35,1,,,,,,1,1,
HH101004901,HH1010049012,2,2,30,1,,,,,,1,1,
HH101004901,HH1010049013,3,2,12,1,1,,,,,1,1,
HH101004901,HH1010049014,3,2,10,1,1,,,,,1,1,
HH101004901,HH1010049015,3,2,7,2,,,,,,1,1,5
HH101004901,HH1010049016,3,1,3,1,,,,,,1,1,
HH101004901,HH1010049017,3,1,0,1,,,,,,1,1,
HH101004901,HH1010049018,8,1,50,2,,,,,,1,1,5
HH101005001,HH1010050011,1,1,31,1,,,,,,1,1,
HH101005001,HH1010050012,2,2,25,1,,,,,,1,1,
HH101005001,HH1010050013,3,2,15,1,2,,,,,1,1,
HH101005001,HH1010050014,3,1,12,1,1,,,,,1,1,
HH101005001,HH1010050015,3,1,10,1,1,,,,,1,1,
HH101005001,HH1010050016,3,1,9,1,1,,,,,1,1,
HH101005001,HH1010050017,3,2,5,1,,,,,,1,1,
HH101005001,HH1010050018,3,1,0,1,,,,,,1,1,
HH101005201,HH1010052011,1,2,62,1,,,,,,1,1,
HH101005201,HH1010052012,3,2,23,1,,,,,,1,1,
HH101005201,HH1010052013,3,2,20,1,,,,,,1,1,
HH101005201,HH1010052014,3,1,18,1,,,,,,1,1,
HH101005201,HH1010052015,3,1,14,1,1,,,,,1,1,
HH101005201,HH1010052016,5,1,3,1,,,,,,1,1,
HH101005201,HH1010052017,5,2,2,1,,,,,,1,1,
HH101005201,HH1010052018,3,1,8,2,1,,,,,1,1,
HH101005201,HH1010052019,3,1,4,2,,,,,,1,1,
HH101005301,HH1010053011,1,2,40,1,,,,,10/25/2016,1,1,
HH101005301,HH1010053012,3,2,14,1,1,,,,10/25/2016,1,1,
HH101005301,HH1010053013,3,1,9,1,1,,,,10/25/2016,1,1,
HH101005301,HH1010053014,3,1,2,1,,,,,10/25/2016,1,1,
HH101005301,HH1010053015,3,2,17,1,,,,,10/25/2016,1,1,
HH101005401,HH1010054011,1,1,45,1,,,,,10/27/2016,1,1,
HH101005401,HH1010054012,2,2,46,1,,,,,10/27/2016,1,1,
HH101005401,HH1010054013,3,1,20,1,,,,,10/27/2016,1,1,
HH101005401,HH1010054014,3,1,18,1,,,,,10/27/2016,1,1,
HH101005401,HH1010054015,3,1,16,1,1,,,,10/27/2016,1,1,
HH101005401,HH1010054016,3,2,14,1,1,,,,10/27/2016,1,1,
HH101005401,HH1010054017,3,2,12,1,1,,,,10/27/2016,1,1,
HH101005401,HH1010054018,3,2,10,1,1,,,,10/27/2016,1,1,
HH101005401,HH1010054019,3,1,8,1,1,,,,10/27/2016,1,1,
HH101005402,HH1010054021,1,2,74,1,,,,,10/27/2016,1,1,
HH101005501,HH1010055011,1,1,57,1,,,,,10/26/2016,1,1,
HH101005501,HH10100550110,3,2,10,1,1,,,,10/26/2016,1,1,
HH101005501,HH10100550111,3,1,8,1,2,,,,10/26/2016,1,1,
HH101005501,HH10100550112,3,2,6,1,,,,,10/26/2016,1,1,
HH101005501,HH10100550113,3,1,4,1,,,,,10/26/2016,1,1,
HH101005501,HH10100550114,3,2,3,1,,,,,10/26/2016,1,1,
HH101005501,HH10100550115,9,1,7,1,,,,,10/26/2016,1,1,
HH101005501,HH10100550116,9,2,16,1,1,,,,10/26/2016,1,1,
HH101005501,HH1010055012,2,2,54,1,,,,,10/26/2016,1,1,
HH101005501,HH1010055013,3,2,24,1,,,,,10/26/2016,1,1,
HH101005501,HH1010055014,3,2,29,1,,,,,10/26/2016,1,1,
HH101005501,HH1010055015,3,1,22,1,,,,,10/26/2016,1,1,
HH101005501,HH1010055016,3,1,19,1,,,,,10/26/2016,1,1,
HH101005501,HH1010055017,3,2,16,1,1,,,,10/26/2016,1,1,
HH101005501,HH1010055018,9,2,14,1,1,,,,10/26/2016,1,1,
HH101005501,HH1010055019,3,2,12,1,1,,,,10/26/2016,1,1,
HH101005601,HH1010056011,1,1,74,1,,,,,10/26/2016,1,1,
HH101005601,HH1010056012,2,2,52,1,,,,,10/26/2016,1,1,
HH101005601,HH1010056013,3,2,30,1,,,,,10/26/2016,1,1,
HH101005601,HH1010056014,3,1,20,1,,,,,10/26/2016,1,1,
HH101005601,HH1010056015,3,2,15,1,1,,,,10/26/2016,1,1,
HH101005601,HH1010056016,5,2,8,1,1,,,,10/26/2016,1,1,
HH101005601,HH1010056017,5,1,5,1,,,,,10/26/2016,1,1,
HH101005601,HH1010056018,5,2,3,1,,,,,10/26/2016,1,1,
HH101005601,HH1010056019,5,1,2,1,,,,,10/26/2016,1,1,
HH101005701,HH1010057011,1,1,70,1,,,,,10/26/2016,1,1,
HH101005701,HH1010057012,2,2,48,1,,,,,10/26/2016,1,1,
HH101005701,HH1010057013,3,2,18,1,,,,,10/26/2016,1,1,
HH101005701,HH1010057014,3,2,16,1,1,,,,10/26/2016,1,1,
HH101005701,HH1010057015,3,1,13,1,1,,,,10/26/2016,1,1,
HH101005701,HH1010057016,3,2,8,1,1,,,,10/26/2016,1,1,
HH101005701,HH1010057017,3,2,6,1,,,,,10/26/2016,1,1,
HH101005701,HH1010057018,3,1,1,1,,,,,10/26/2016,1,1,
HH101005701,HH1010057019,3,1,1,1,,,,,10/26/2016,1,1,
HH101005702,HH1010057021,3,2,60,1,,,,,10/26/2016,1,1,
HH101005702,HH1010057022,8,2,70,1,,,,,10/26/2016,1,1,
HH101005801,HH1010058011,1,1,64,1,,,,,10/26/2016,1,1,
HH101005801,HH1010058012,2,2,55,1,,,,,10/26/2016,1,1,
HH101005801,HH1010058013,3,1,16,1,1,,,,10/26/2016,1,1,
HH101005801,HH1010058014,3,2,17,1,1,,,,12/10/2016,1,1,
HH101005802,HH1010058021,1,1,22,1,,,,,10/26/2016,1,1,
HH101005802,HH1010058022,2,2,20,1,,,,,10/26/2016,1,1,
HH101005802,HH1010058023,3,2,0,1,,,,,10/26/2016,1,1,
HH101005802,HH1010058024,9,2,1,2,,,,,12/10/2016,1,1,
HH101005802,HH1010058025,3,2,10,1,1,,,,12/10/2016,1,1,
HH101005802,HH1010058026,3,2,1,2,,,,,12/10/2016,1,1,
HH101005901,HH1010059011,1,2,74,1,,,,,10/26/2016,1,1,
HH101005901,HH1010059012,6,2,95,1,,,,,10/26/2016,1,1,
HH101006001,HH1010060011,1,1,21,1,,,,,10/26/2016,1,1,
HH101006001,HH1010060012,8,1,28,1,,,,,10/26/2016,1,1,
HH101006001,HH1010060013,8,1,19,1,,,,,10/26/2016,1,1,
HH101006101,HH1010061011,1,1,83,1,,,,,10/26/2016,1,1,
HH101006101,HH10100610110,3,2,14,2,1,,,,12/09/2016,1,1,
HH101006101,HH10100610111,3,2,24,2,,,,,12/12/2016,1,1,
HH101006101,HH10100610112,2,2,50,2,,,,,12/09/2016,1,1,
HH101006101,HH10100610113,3,1,19,2,,,,,12/09/2016,1,1,
HH101006101,HH1010061012,2,2,60,1,,,,,10/26/2016,1,1,
HH101006101,HH1010061013,3,2,16,1,1,,,,10/26/2016,1,1,
HH101006101,HH1010061014,3,2,13,1,1,,,,10/26/2016,1,1,
HH101006101,HH1010061015,3,2,13,1,1,,,,10/26/2016,1,1,
HH101006101,HH1010061016,3,2,9,1,1,,,,10/26/2016,1,1,
HH101006101,HH1010061017,3,2,5,1,,,,,10/26/2016,1,1,
HH101006101,HH1010061018,6,2,90,2,,,,,12/09/2016,1,1,
HH101006101,HH1010061019,3,1,21,2,,,,,12/12/2016,1,1,
HH101006102,HH1010061021,1,1,30,1,,,,,10/26/2016,1,1,
HH101006102,HH1010061022,2,2,21,1,,,,,10/26/2016,1,1,
HH101006102,HH1010061023,3,2,1,1,,,,,10/26/2016,1,1,
HH101006201,HH1010062011,1,1,48,1,,,,,10/26/2016,1,1,
HH101006201,HH10100620110,3,2,8,1,1,,,,10/26/2016,1,1,
HH101006201,HH10100620111,5,1,7,1,,,,,10/26/2016,1,1,
HH101006201,HH10100620112,5,2,6,1,,,,,10/26/2016,1,1,
HH101006201,HH10100620113,5,1,1,1,,,,,10/26/2016,1,1,
HH101006201,HH10100620114,3,2,2,2,,,,,10/26/2016,1,1,
HH101006201,HH1010062012,2,2,52,1,,,,,10/26/2016,1,1,
HH101006201,HH1010062013,3,2,28,1,,,,,10/26/2016,1,1,
HH101006201,HH1010062014,3,2,26,1,,,,,10/26/2016,1,1,
HH101006201,HH1010062015,3,1,22,1,,,,,10/26/2016,1,1,
HH101006201,HH1010062016,3,1,19,1,,,,,10/26/2016,1,1,
HH101006201,HH1010062017,3,1,17,1,1,,,,10/26/2016,1,1,
HH101006201,HH1010062018,3,1,14,1,1,,,,10/26/2016,1,1,
HH101006201,HH1010062019,3,1,8,1,1,,,,10/26/2016,1,1,
HH101006301,HH1010063011,1,1,78,1,,,,,10/27/2016,1,1,
HH101006401,HH1010064011,1,1,66,1,,,,,10/27/2016,1,1,
HH101006401,HH10100640110,4,2,19,1,,,,,10/27/2016,1,1,
HH101006401,HH10100640111,3,1,30,2,,,,,12/10/2016,1,1,
HH101006401,HH10100640112,5,2,3,2,,,,,12/10/2016,1,1,
HH101006401,HH10100640113,5,2,4,2,,,,,12/10/2016,1,1,
HH101006401,HH10100640114,5,2,7,2,,,,,12/10/2016,1,1,
HH101006401,HH10100640115,5,2,1,2,,,,,12/10/2016,1,1,
HH101006401,HH10100640116,3,2,43,2,,,,,10/27/2016,1,1,
HH101006401,HH10100640117,3,1,1,2,,,,,10/27/2016,1,1,
HH101006401,HH1010064012,2,2,65,1,,,,,10/27/2016,1,1,
HH101006401,HH1010064013,7,2,70,1,,,,,10/27/2016,1,1,
HH101006401,HH1010064014,3,1,45,1,,,,,10/27/2016,1,1,
HH101006401,HH1010064015,3,2,29,1,,,,,10/27/2016,1,1,
HH101006401,HH1010064016,3,2,18,1,,,,,10/27/2016,1,1,
HH101006401,HH1010064017,3,1,17,1,1,,,,10/27/2016,1,1,
HH101006401,HH1010064018,5,1,6,1,,,,,10/27/2016,1,1,