﻿ID,GroupRec,SEX,AGE,MaritalFinal,EducFinal,YearsSinceLeave,Child_Sex,Child_Age,DISASTER,ACCID,ILLNESS,INJURY,COMBAT,WAR,PRISON,KIDNAP,CAMP,FLIGHT_DANGER,FAMILY_ASSAULT,OTHER_ASSAULT,FORC_ISOLATION,BRAINWASH,TORTURE,RAPE,OTHERSEXUAL,TOXIC_SUB,SEP_FAMILY,FOOD_WATER,SHELTER,ILL_NO_HEALTHCARE,CLOSE_MURDER,UNNAT_DEATH,SEE_MURDER,CLOSE_DISAPPEAR,OTHER,PMLD,COMMUNIC_DIFF,DISCRIM,ETHNIC_CONFLICT,FAMILY_SEP,FAMILY_WORRY,NO_RETURN_HOME,EMPLOY,MIGRAT_OFFICIAL,OTHER_OFFICIAL,NO_REFUG_RECOG,FEAR_SENT_HOME,NO_HEALTH_ACCESS,POVERTY,FINANC_ASSIST,LONELINESS,LEARNING_ARABIC,ACCOMMOD,Group,Date,HOPAnxPre,HOPAnxPost,HOPAnxFUp,HOPDepPre,HOPDepPost,HOPDepFUp,PCLPre,PCLPost,PCLFUp,WHODASPre,WHODASPost,WHODASFUp,CHLOPPre,CLOPPost,CHLOPFUp,PG13Pre,PG13Post,PG13FUp,PQPre,PQPost,PQFUp,COVIDFUp,InvolvPre,InvolvPo,InvolFUp,PosParPr,PosParPo,PosParFU,SupPre,SuperPost,SuperFUp,DiscPre,DiscPost,DiscFUp,PunPre,PunPost,PunFUp,preatt,postatt,fupatt,preint,postint,fupint,preext,postext,fupext
211002,2,1,30,1,0,3,1,11,0,1,0,0,0,0,0,0,1,1,0,0,0,0,0,0,0,0,0,1,1,1,0,0,0,0,0, ,2,2,0,2,4,2,4,0,1,0,2,3,3,0,2,0,3,1,"Nov. 19, 2019",31,17,13,33,20,18,18,0,3,23,12,20,15,9,5, , , ,16,16,15,12,18,22,32,18,16,19,14,14,10,18,16,10,6,4,5,3,3,4,1,2,4,2,2,2
211003,1,1,32,1,1,4,1,12,1,1,1,0,0,0,0,0,1,0,0,0,0,0,0,0,0,1,0,1,1,1,0,0,0,0,0, ,2,1,2,1,2,0,0,0,0,2,2,3,3,0,2,0,0,2,"Nov. 20, 2019",32,32,32,50,44,41,52,19,0,27,26,28,16,19,20, , , ,9,11,13,29,22,29,32,16,16,17,24,28,12,22,14,18,11,11,7,6,3,2,2,1,2,5,2,3
211004,2,2,42,1,1,4,2,13,1,1,1,1,0,0,1,0,1,0,0,0,0,0,0,0,0,0,0,0,0,1,0,0,0,0,0, ,0,0,0,4,4,4,2,0,0,0,0,4,4,0,3,0,0,1,"Nov. 24, 2019",32,22,20,44,21,26,45,15,9,24,6,15,20,18,14,41,25,19,14,16,16,23,37,30,31,28,24,26,15,10,14,15,11,16,3,3,5,2,7,7,1,2,3,2,5,3
211006,2,1,36,1,1,5,1,11,1,1,1,1,0,1,1,0,1,1,1,1,0,0,1,0,0,0,0,1,1,1,1,1,0,1,0, ,0,4,3,4,3,3,4,0,0,4,3,4,4,4,4,0,2,1,"Nov. 26, 2019",35,20,14,46,30,25,31,13,20,34,19,13,20,17,16,27,21,11,14,13,16,26,15,23,30,17,10,19,19,13,11,18,14,12,6,10,6,5,5,2,4,2,3,5,4,2
211007,2,2,52,1,3,4,1,14,1,1,0,1,1,1,0,0,1,1,0,1,0,1,1,0,0,0,1,1,1,1,1,1,0,0,0, ,0,2,0,0,4,3,4,0,0,0,2,0,4,4,4,0,0,1,"Nov. 18, 2019",33, ,13,52, ,28,49, ,0,23, ,22,18, ,10,37, ,19,10, ,16,4,28, ,22,20, ,15,14, ,13,15, ,16,5, ,10, , , , , , , , , 
211011,1,1,44,2,0,4,2,12,1,1,1,1,0,0,0,1,1,1,0,0,0,0,1,0,0,0,0,1,1,0,0,0,0,0,0, ,0,3,0,4,3,0,3,0,0,0,3,3,4,3,0,0,0,2,"Nov. 17, 2019",39,21,17,41,23,33,28,27,0,27,23,20,16,8,17, , , ,15,16,16,12,41,42,20,25,27,16,13,14,12,12,14,10,3,3,4,4,6,2,4,4,2,3,4,3
211013,2,2,55,1,4,6,2,12,1,1,0,0,0,0,1,0,1,0,0,0,0,0,0,0,0,0,0,0,0,0,0,0,0,0,0, ,0,0,0,0,0,0,0,0,0,0,0,0,1,0,1,0,0,1,"Nov. 17, 2019",21,17,12,19,23,15,20,9,0,24,11,20,7,1,12, , , ,15,13,16,0,22,29,23,21,30,18,14,12,12,6,7,7,3,3,3,8,4,4,4,2,2,4,5,4
211014,1,1,32,2,1,4,2,12,0,1,0,0,0,0,0,0,1,1,0,0,0,0,0,0,0,0,0,1,1,1,0,0,0,0,0, ,3,3,3,3,4,0,3,0,0,0,0,4,4,3,4,0,0,2,"Nov. 17, 2019",35,18,17,44,32,31,30,14,0,30,6,1,20,8,17,39,22,23,15,12,16,7,28,39,23,24,29,18, ,22,15,16,15,14,9,3,6,5,6,4,4,1,3,3,3,3
211015,2,1,37,2,1,4,1,14,1,1,1,1,0,1,1,1,1,1,0,0,0,0,0,0,0,0,1,1,1,1,0,0,1,0,0, ,3,3,0,3,3,3,3,0,3,3,3,0,4,0,2,0,0,1,"Nov. 17, 2019",32,23,25,35,44,41,38,0,15,23,21,17,17,19,11, , , ,14,16,16,18,26,27,36,18,23,16,12,10,10,20,14,10,7,7,11,8,3,5,4,2,5,6,4,5
211016,2,1,45,1,1,7,2,10,1,1,1,1,0,0,0,0,1,0,0,0,0,0,0,0,0,0,0,0,0,1,0,0,0,0,0, ,0,0,0,3,3,3,0,0,0,0,0,3,4,3,2,0,0,1,"Nov. 20, 2019",39,29,30,48,39,32,39,20,0,44,28,25,20,10,15, , , ,16,12,12,22,24,38,26,25,28,19,12,13,10,16,14,7,3,5,3,5,4,4,2,2,2,3,3,2
211018,2,1,46,4,1,6,2,11,1,1,0,0,0,1,1,0,1,1,0,0,0,0,0,0,0,0,0,1,0,1,0,1,1,0,0, ,0,0,0,2,2,0,2,0,0,0,0,3,3,3,2,0,0,1,"Nov. 20, 2019",38,14,15,47,22,25,31,13,0,28,9,14,17,6,15,35,18,17,15,14,16,6,26,43,25,22,26,17,13,17,10,19,9,13,8,8,8,4,5,5,3,0,2,3,2,4
211019,2,1,42,1,1,6,2,10,1,1,1,0,0,0,0,0,1,1,0,0,0,0,0,0,0,0,0,1,1,1,0,0,0,0,0, ,0,4,0,4,4,0,4,0,0,0,0,1,4,3,0,0,0,1,"Nov. 18, 2019",21,20,29,32,28,28,23,15,0,24,16,21,19,15,20, , , ,16,16,16,25,30,31,36,27,24, ,14,10,10,14,12,15,6,4,3,3,1,4,0,3,3,2,2,3
211021,1,1,39,4,1,5,2,14,1,1,0,0,0,0,0,0,1,1,0,0,0,0,0,0,0,0,0,1,1,0,0,1,1,0,0, ,0,0,1,0,0,0,0,0,0,0,3,0,1,0,0,0,0,2,"Nov. 21, 2019",26,15,15,33,22,20,23,8,0,19,7,18,20,5,11,27,25,19,15,14,16,4,35,50,35,30,29,22,13,18,10,18,13,8,3,5,3, , , , , , , , , 
211023,2,1,36,2,0,5,2,12,1,1,0,0,0,0,1,0,1,1,0,0,0,0,1,0,1,0,1,1,1,1,0,0,0,1,0, ,0,0,0,4,3,3,0,0,0,0,0,2,3,3,3,0,3,1,"Nov. 19, 2019",33,22,27,28,27,26,36,16,5,22,12,21,16,14,13,39,33,20,12,16,16,22,31,33,30,22,21,24,13,10,14,10,13,12,5,4,5,1,6,3,0,4,1,3,2,4
211025,1,1,30,1,1,5,2,12,1,1,1,0,0,1,1,0,1,1,0,0,0,1,1,0,0,0,0,0,0,0,0,1,0,1,0, ,0,0,0,3,0,0,1,0,0,0,0,0,2,0,2,0,0,2,"Nov. 24, 2019",32,14,18,42,23,38,26,0,0,29,14,18,17,12,20,20,18,18,13,16,14,29,30,33,28,27,23,27,11,13,10,6,10,15,4,5,5,0,2,4,2,1,4,4,1,2
211026,1,1,34,1,0,5,2,11,0,1,0,0,0,1,0,0,1,0,0,0,0,0,0,0,0,0,0,0,0,0,0,0,0,0,0, ,1,0,0,4,0,4,0,0,0,0,0,0,4,3,3,0,0,2,"Nov. 19, 2019",32, , ,41, , ,26, , ,27, , ,9, , ,27, , ,14, , , ,29, , ,25, , ,14, , ,16, , ,3, , ,4, , ,4, , ,3, , 
211028,1,1,53,4,1,9,2,12,1,1,1,0,0,0,0,0,1,0,0,0,0,0,0,0,0,0,0,1,1,1,0,1,0,0,0, ,1,0,0,4,4,3,0,3,0,2,2,3,1,3,2,0,0,2,"Nov. 18, 2019",31,22,17,45,23,33,17,23,0,38,20,24,16,14,15,16,18,11,16,14,15,16,22,38,16,22,28,25,10,14,10,13,19,16,5,5,4,6, ,5,6, ,5,2, ,3
211029,2,1,27,1,1,9,2,13,0,1,1,1,1,0,1,0,1,1,0,1,0,0,0,0,0,0,0,1,0,1,0,1,0,1,0, ,3,0,0,2,3,3,0,0,0,0,3,1,1,1,0,0,3,1,"Nov. 18, 2019",16,12,12,20,16,19,10,0,2,19,6,10,15,11,7,13,12,13,14,16,16,19,26,35,41,17,21,22,12,10,12,18,13,12,8,5,7,6,3,6,1,3,2,2,6,2
211030,1,1,40,2,1,9,1,12,0,0,0,0,0,0,0,0,1,0,0,0,0,0,0,0,0,0,0,0,0,0,0,0,0,0,0, ,0,0,0,0,1,0,1,0,0,0,3,0,3,1,0,0,0,2,"Nov. 18, 2019",40,19,19,41,27,35,30,0,0,38,25,13,20,17,8,24,21,23,16,16,16,5,34,50,26,30,29,19,22,11,10,15,15,11,5,5,5,3,6,2,2,2,4,5,2,5
211031,1,1,36,1,0,9,1,11,1,1,0,0,0,1,0,0,1,0,0,0,0,0,0,0,0,0,0,1,0,0,0,0,0,0,0, ,0,0,0,3,3,3,3,0,0,0,0,0,3,3,3,0,0,2,"Nov. 19, 2019",35,33,23,49,39,35,39,28,0,30,17,24,20,15,15, , , ,13,12,15,19,19,43,15,22,24,8,14,17,14,22,12,14,7,7,9, , , , , , , , , 
211032,2,1,46,1,0,4,1,11,1,0,0,0,0,0,0,0,1,1,0,0,0,0,0,0,0,0,0,0,0,0,0,0,0,0,0, ,0,0,0,0,0,0,0,0,0,0,0,2,3,0,2,0,3,1,"Nov. 25, 2019",28,14,12,49,22,19,26,18,0,25,16,20,20,18,16, , , ,16,14,16,8,27,42,38,23,27,19,16,11,10,16,17,6,7,7,3, , , , , , , , , 
211033,2,1,37,1,1,4,2,12,1,1,1,1,1,1,1,1,1,1,0,0,0,0,0,0,0,0,0,1,1,1,1,1,1,0,0, ,0,2,0,4,4,3,4,0,0,0,3,3,3,3,3,0,3,1,"Nov. 19, 2019",32,21,27,49,31,45,51,0,17,21,22,16,19,19,19, , , ,13,16,14,36,33,30,45,25,23,24,18,10,10,16,14,16,7,8,10,0,4,7,1,3,7,4,3,5
211034,2,1,39,1,1,5,2,11,1,1,1,0,0,0,0,0,1,1,0,0,0,0,0,0,0,0,0,0,0,1,0,0,0,0,0, ,0,0,0,3,2,3,3,0,0,0,1,3,3,3,3,0,0,1,"Nov. 20, 2019",27,17,19,36,24,24,29,21,18,18,12,21,20,15,18, , , ,11,13,15,30,34,33,39,25,23,23,12,10,14,16,16,12,5,5,6,3,4,4,3,2,2,3,4,2
211035,1,1,43,1,0,4,2,14,1,1,1,1,0,1,1,0,1,1,0,0,0,0,0,0,0,0,0,1,0,0,0,0,0,0,0, ,0,0,0,3,3,0,3,0,0,0,3,3,2,3,0,0,0,2,"Nov. 21, 2019",24, ,17,38, ,22,21, ,0,32, ,10,13, ,15,19, ,23,15, ,16,8,24, ,32,17, ,22,14, ,14,16, ,9,3, ,7, , , , , , , , , 
211036,1,1,39,1,1,5,2,12,1,0,1,1,0,0,0,0,1,0,0,0,0,0,0,0,0,0,0,0,0,0,0,0,0,0,0, ,0,3,0,3,0,3,4,0,0,0,3,0,4,0,2,0,0,2,"Nov. 20, 2019",30,19,14,38,26,31,17,6,0,35,14,21,16,5,4,30,18,11,14,15,15,22,18, ,22,18,27,23,10,10,10,15,14,15,5,7,5,6,5,4,1,3,2,3,0,2
211037,1,2,45,1,1,5,1,12,1,1,1,1,1,1,0,0,1,1,0,1,0,0,1,0,0,0,0,1,1,1,1,1,1,0,0, ,0,0,0,3,3,0,3,0,0,0,0,2,2,0,1,0,0,2,"Nov. 21, 2019",32,25,16,29,38,36,29,37,0,33,24,21,14,18,17,19,20,13,14,13,14,20,28,44,31,27,29,29,10,16,16,11,10, ,3,4,3,3,3,2,2,6,6,4,4,4
211039,1,1,45,2,3,4,2,13,1,1,0,0,0,0,1,0,1,1,0,0,0,0,0,0,0,0,0,0,0,1,0,1,0,0,0, ,0,3,0,3,3,3,3,0,0,0,0,3,3,3,3,0,0,2,"Nov. 25, 2019",39,25,23,51,24,35,34,8,0,21,22,16,17,18,15, , , ,13,16,14,27,31,33,30,26,23,23,12,12,14,19,12,18,5,5,7,4,3,4,0,3,4,2,4,4
211040,1,1,46,4,1,5,1,12,1,1,0,0,1,1,1,0,1,0,0,1,0,1,1,0,0,0,1,1,1,1,1,1,1,1,0, ,2,3,0,4,4,3,4,0,0,4,0,3,4,4,2,0,0,2,"Nov. 25, 2019",31,16,16,50,25,45,37,0,31,20,8,18,18,16,18,30,24,11,15,13,16,13,42,27,30,25,24,22,10,12,12,10,12,11,5,3,4,7,4, ,1,3, ,2,1, 
211041,2,1,36,1,1,4,2,11,1,1,0,0,0,0,0,0,1,1,0,0,0,0,0,0,0,0,0,0,0,0,0,0,0,0,0, ,0,0,0,2,3,2,4,0,0,0,2,0,4,4,2,0,0,1,"Nov. 21, 2019",27,32,10,27,48,23,12,39,0,42,22,12,16,20,20, , , ,15,13,16,18,34,45,31,24, ,18,18,14,10,20,16,6,3,7,6,2,7,3,4,6,4,3,2,5
211042,1,1,52,1,1,5,1,11,1,1,1,1,1,1,0,0,1,1,0,0,0,1,0,0,0,0,0,0,0,0,1,1,0,0,0, ,0,0,0,3,0,0,0,0,0,0,0,0,2,0,3,0,2,2,"Nov. 24, 2019",23,17,19,35,26,52,18,17,19,41,20,15,12,18,19,17,17,15,16,16,14,0,24,20, ,13,18,18,16,13, ,18,10,12,6,5,4,8,3,3,3,1, ,4,3, 
211044,2,1,35,1,1,4,1,11,1,1,0,0,0,0,0,0,1,0,0,0,0,1,0,0,0,0,0,1,1,0,0,1,0,0,0, ,2,0,0,3,4,0,4,0,0,0,4,4,4,4,3,0,2,1,"Nov. 25, 2019",33,15,30,51,19,31,39,14,0,38,15,27,18,3,15,23,18,11,9,15,15,28,34,50,38,30,30,24,14,10,10,18,18,17,3,4,3,2,1,0,1,2,3,5,3,4
211045,1,1,37,1,1,4,1,13,1,1,1,1,0,1,1,0,1,1,0,0,0,1,1,0,0,0,0,1,1,0,0,0,0,0,0, ,2,0,3,3,3,0,3,0,0,0,0,3,2,3,2,0,3,2,"Nov. 21, 2019",25,21,27,30,27,29,50,8,9,18,11,13,16,18,17,31,16,16,8,16,16,30,31, ,45,16,23,26,15,10,10,24,14,17,11,7,5,2,3,5,3,3,3,3,4,4
211046,1,1,31,1,1,4,2,11,0,0,1,0,0,1,0,0,1,1,0,0,0,0,0,0,0,0,0,0,0,0,0,0,0,0,0, ,4,0,0,2,3,4,4,4,0,0,4,2,3,3,0,0,0,2,"Nov. 21, 2019",31,20,35,46,37,39,30,0,32,28,29,25,17,19,15, , , ,11,11,15,12,42,44,30,28,25,19,14,27,16,17,21,20,6,5,6, , , , , , , , , 
211047,1,1,41,2,3,4,2,12,0,1,0,0,1,1,1,0,1,1,0,0,0,0,1,1,1,0,0,1,1,1,1,1,0,0,0, ,1,0,3,0,3,0,3,3,0,0,4,3,4,2,3,0,0,2,"Nov. 21, 2019",32,21,19,46,34,41,52,16,40,35,22,21,20,15,20,42,45,41,10,16,9,6,21,27,26,21,19,19,23,15,11,17,13,14,11,8, ,5,5,3,2,0,3,4,1,4
211049,1,1,29,1,1,4,2,12,1,1,0,0,0,0,0,0,1,1,0,0,0,0,0,0,0,0,0,0,0,1,0,0,0,0,0, ,3,0,0,0,0,0,0,0,0,0,2,2,3,2,0,0,0,2,"Jan. 6, 2020",19,18,16,40,32,28,13,0,0,30,20,10,14,11,9,24,12,11,16,16,15,20,18,20,34,6,13,19,14,14,18,11,16,17,5,9,7,3,4,4,5,5,4,3,4,3
211050,1,1,38,1,1,7,1,12,1,0,1,0,0,1,0,0,1,1,0,0,0,1,0,0,0,0,0,1,1,1,0,0,0,0,0, ,2,2,1,3,2,2,1,0,0,0,2,2,4,3,1,0,2,2,"Jan. 6, 2020",30,30,26,41,41,35,46,32,0,29,18,21,19,20,11,41,20,23,12,16,8,23,35,29,39,26,23,22,14,10,15,13,14,9,6,5,6,4,5,4,2,3,3,4,4,2
211054,2,1,44,3,1,4,1,12,1,1,1,0,0,1,0,0,1,1,0,0,0,0,1,0,0,0,0,1,1,1,0,1,1,0,0, ,0,3,0,1,4,4,4,0,0,0,4,4,4,3,4,0,0,1,"Jan. 6, 2020",33,27,17,57,43,38,53,20,0,30,15,19,20,13,19,32,23,17,11,16,16,21,37,41,26,24,25,18,18,16,10,14,14,15,5,5,6, , , , , , , , , 
211055,2,1,37,2,1,4,1,14,1,1,1,1,0,0,0,0,1,1,0,0,0,0,0,0,0,0,0,1,0,1,0,0,0,0,0, ,0,3,0,3,3,4,4,0,0,0,3,1,4,3,1,0,0,1,"Jan. 5, 2020",35,22,14,39,22,20,24,0,14,25,22,21,20,16,11,19,12,13,14,16,15,21,26,34,42,16,23,23,10,10,10,13,14,12,6,6,5,0,3, ,4,4, ,4,4, 
211057,2,1,35,1,0,5,1,11,1,1,0,0,0,0,0,0,1,1,0,0,0,0,0,0,0,0,0,0,0,1,0,0,0,0,0, ,2,3,2,4,0,0,3,0,0,0,3,3,3,0,0,0,3,1,"Dec. 31, 2019",39,24,33,49,37,43,40,0,43,18,12,11,18,18,19, , , ,12,16,15,25,35,31,27,26,24,17,13,12,10,20,13,17,12,7,11,4,3,4,1,3,1,4,5,5
211058,2,1,43,1,3,5,2,13,1,1,1,1,1,1,1,0,1,1,0,1,0,0,1,0,0,0,0,1,1,1,1,1,0,1,0, ,2,3,3,3,3,3,4,0,2,2,3,4,3,3,2,0,3,1,"Dec. 31, 2019",33,18,24,31,26,35,19,0,7,18,8,15,18,19,12,19,12,12,16,16,13,27,15,27,26,11,21,11,14,10,15,19,16,12,7,6,5,3,2,1,1,5,2,4,3,4
211060,1,1,40,1,3,6,1,14,1,1,1,0,0,1,0,0,1,1,0,1,0,1,1,0,1,0,0,0,0,1,0,0,1,0,0, ,1,2,1,4,4,2,2,2,0,0,0,1,3,2,3,0,0,2,"Jan. 5, 2020",34,23,22,43,28,37,27,0,1,30,27,27,17,19,13,49,39,18,13,16,16,19,13,29,50,21,20,28,11,10,10,10,14,6,10,9,3, , , , , , , , , 
212002,2,1,38,1,1,7,1,12,1,1,0,0,0,1,0,0,1,1,0,0,0,0,0,0,0,0,0,1,1,1,0,0,1,0,0, ,0,2,3,3,3,4,3,0,0,0,0,0,2,0,3,0,0,1,"Nov. 21, 2019",26,21,37,54,28,54,74,23,39,20,13,23,20,19,20,36,42,31,12,16,16,30,26,24,25,23,21,21,24,11,14,23,13,19,8,7,6,6,2, ,3,-1, ,6,1, 
212006,2,1,48,1,1,7,1,13,0,1,0,0,0,1,0,0,0,1,0,0,0,0,0,0,0,0,0,0,1,0,0,1,0,0,0, ,0,0,0,0,4,0,3,0,0,0,0,4,3,4,4,0,0,1,"Nov. 18, 2019",30,29,22,57,41,46,0,21,0,34,25,38,15,20,20,39,39,12,14,16,15,12,30,25,21,21,21,20,10,10,10,26,12,12,13,3,8, , , , , , , , , 
212007,2,2,45,1,0,4,1,10,1,1,1,1,0,1,0,0,1,1,0,1,0,0,0,0,0,0,0,1,0,0,0,0,1,0,0, ,0,0,0,0,3,0,4,4,0,0,0,2,3,3,0,0,0,1,"Nov. 19, 2019",24,30,13,23,33,15,0,26,0,23,18,23,18,4,15,32,30,23,14,15,16,26,30,17,28,15,6,17,12,14,11,16,10,11,7,3,8,3,3,2,2,3,2,3,5,1
212009,2,1,32,1,0,4,2,11,0,0,0,1,0,1,1,0,1,1,0,1,0,0,1,0,0,0,0,1,1,0,0,0,1,0,0, ,0,0,0,4,3,0,0,0,0,0,3,0,0,0,3,0,0,1,"Nov. 20, 2019",20,20,13,34,30,20,0,28,0,26,20,20,15,15,16, , , ,14,14,16,10, ,26,24,18,19,17,14,12,10,19,18,10,7,7,4,1,6,2,5,4,4,3,2,2
212012,1,2,39,1,3,5,1,12,0,1,0,1,0,1,0,1,1,1,0,0,0,0,0,0,0,0,0,1,1,1,0,0,1,1,0, ,2,4,0,2,3,4,4,4,0,0,4,0,2,4,0,0,0,2,"Nov. 19, 2019",18,14,27,36,34,42,37,0,14,22,7,4,12,14,11,20,14,14,11,16,16,21,40,38,48,30,25,28,18,10,13,18,14,11,5,5,3,6,3,4,4,2,3,4,3,3
212013,1,1,44,1,1,5,2,12,1,1,0,1,0,1,0,0,1,0,0,0,0,0,0,0,0,0,0,0,0,0,0,0,0,0,0, ,0,3,0,0,3,0,3,0,0,0,3,3,4,3,3,0,0,2,"Nov. 18, 2019",31,18,27,36,30,33,0,0,19,17,22,20,20,19,18, , , ,15,16,15,32,32,31,46,28,24,30,14,10,10,8,11,14,7,3,5,1,1,4,1,2,1,1,2,1
212015,2,1,36,1,1,5,1,12,0,0,0,0,0,1,0,0,1,0,0,0,0,0,0,0,0,0,0,0,0,0,0,0,0,0,0, ,0,0,0,4,0,0,4,0,0,0,0,0,4,3,4,0,0,1,"Nov. 18, 2019",14,10,11,18,18,15,0,0,0,22,7,17,18,13,15, , , ,16,16,16,15,31,33,46,23,20,30,12,10,10,13,10,11,3,5,4,0,0,0, ,3, ,2,3,2
212017,1,1,34,1,1,7,1,14,0,0,0,0,1,1,0,1,1,1,1,1,0,1,1,1,0,1,1,1,0,0,1,1,1,1,0, ,2,2,2,0,4,0,2,0,0,0,2,2,0,0,2,0,0,2,"Nov. 20, 2019",15,19,13,31,38,20,36,6,0,21,20,22,9,8,9,28,36,13,10,16,16,11,39,38,28,25,30,18,10,14,12,14,14,16,3,3,6,2,3,2,3,1,3,3,4,4
212018,1,1,34,1,1,5,2,11,0,0,0,0,0,1,0,0,1,1,0,1,0,0,0,0,0,0,0,1,1,0,0,0,0,0,0, ,2,3,0,0,4,2,4,0,0,0,3,3,3,3,3,0,0,2,"Nov. 19, 2019",18,22,34,39,38,53,30,17,42,27,2,4,16,11,20, , , ,12,16,10,38,41,28,44,25,23,29,16,20,12,15,12,20,9,5,6,6,7,5,3,2,2,2,2,4
212019,1,2,49,1,1,6,2,11,1,1,0,0,0,1,0,0,1,1,0,1,1,0,0,0,0,1,1,1,1,1,1,1,1,0,0, ,0,0,0,0,4,4,3,4,3,2,0,4,4,4,4,0,0,2,"Nov. 18, 2019",33,20,17,52,52,33,49,42,0,21,29,21,18,13,15, , , ,12,15,16,9,20,10,29,10,6,16,14,10,10,16,6,14,4,3,7,1,3,1,0,1,4,2,4,6
212020,2,1,35,1,1,5,2,11,0,1,1,1,0,1,0,0,1,1,0,0,0,0,0,0,0,0,0,1,1,1,0,0,0,1,0, ,0,2,0,0,3,3,4,0,0,3,4,4,4,4,4,0,2,1,"Nov. 19, 2019",24,26,30,53,44,49,44,26,0,22,15,28,19,16,20, , , ,6,16,16,3,20,20,28,12,19,18,10,10,10,15,18,16,9,7,7,3,2,3,3,2,5,2,1,3
212021,1,1,31,1,1,6,2,12,0,0,0,0,0,0,0,0,1,0,0,0,0,0,0,0,0,0,0,0,0,0,0,0,0,0,0, ,0,0,0,0,0,0,3,0,0,0,3,0,3,3,2,0,0,2,"Nov. 20, 2019",23,18,13,15,22,18,0,22,0,37,24,32,17,18,16, , , ,16,14,16,30,33,44,24,18,28,20,12,10,10,20,16,19,5,9,3,0,1,0,2,3,2,3,2,3
212022,2,1,45,1,0,5,1,12,0,0,1,0,0,1,0,0,1,0,0,0,0,0,0,0,0,0,0,0,0,1,0,0,0,0,0, ,0,0,0,3,0,0,4,0,0,0,3,3,4,3,4,0,0,1,"Nov. 20, 2019",29,30,10,38,45,22,47,12,0,26,19,13,20,20,18, , , ,15,16,16,21,33,32,26,25,24,19,10,10,10,16,10,14,4,3,4, , , , , , , , , 
212023,1,1,48,1,0,7,1,11,0,0,0,0,0,1,0,0,1,0,0,0,0,0,0,0,0,0,0,1,1,1,0,0,0,0,0, ,0,0,0,0,0,0,0,0,0,0,3,0,2,0,0,0,0,2,"Nov. 20, 2019",20,15,11,22,17,23,16,5,0,23,30,22,16,15,18, , , ,16,16,16,18,20,20,27,15,21,18,13,10,12,18,6,12,3,3,3, , , , , , , , , 
212024,2,1,48,2,0,7,2,13,1,0,0,0,0,1,0,0,1,1,0,0,0,0,0,0,0,0,0,1,1,1,0,0,0,0,0, ,0,0,0,2,4,0,3,0,0,0,0,0,3,3,0,0,0,1,"Nov. 21, 2019",17,18,14,26,23,18,12,0,0,24,14,20,16,12,13, , , ,15,16,16,10,22,29,27,22,20,16,14,10,10,10,10,11,4,3,7,5,5,1,5,2,2,2,4,3
212025,1,1,51,1,0,4,1,13,0,0,0,0,0,0,0,0,1,0,0,0,0,0,0,0,0,0,0,0,0,0,0,0,0,0,0, ,0,0,0,0,0,0,3,0,0,0,0,0,0,0,0,0,0,2,"Nov. 21, 2019",21,29,13,19,35,20,4,3,0,22,16,10,16,4,13,29,27,17,16,16,16,2,26,25,26,21,25,19,10,10,12,12,10,13,3,5,4, , , , , , , , , 
212026,2,1,34,1,0,5,2,10,0,0,0,0,0,1,0,0,1,1,0,0,0,0,0,0,0,0,0,1,0,1,1,0,0,0,0, ,0,0,1,0,3,0,3,0,0,0,1,2,2,2,2,0,1,1,"Nov. 21, 2019",22,16,31,28,24,45,11,14,10,28,16,16,15,16,7,14,18,11,14,16,16,29,30,33,22,20,20,27,28,14,15,22,15,19,7,6,7,4, , ,3, , ,1, , 
212027,2,1,30,1,1,9,2,13,0,0,0,0,0,1,0,0,1,1,0,0,0,0,0,0,0,0,0,1,1,0,1,1,0,0,0, ,0,0,0,0,0,0,2,0,0,0,2,0,0,0,1,0,0,1,"Nov. 24, 2019",16,13,22,30,20,23,12,16,0,20,0,11,7,12,11,23,19,11,14,16,16,18,30,50,30,20,27,20,12,14,10,11,14,14,5,4,5,2,2,1,3,1,3,3,4,2
212028,2,1,34,1,1,5,2,11,0,1,0,0,0,1,0,0,1,1,0,0,0,0,0,0,0,0,0,0,0,1,0,0,0,0,0, ,0,0,0,0,3,0,0,0,0,0,0,0,0,0,0,0,0,1,"Nov. 25, 2019",26,13,27,35,27,27,7,10,9,26,12,9,16,19,17, , , ,16,16,15,30,35,30,45,23,29,27,14,14,10,16,12,11,5,5,5,6,8, ,2,2, ,3,3, 
212030,2,1,34,1,1,6,2,10,0,1,1,0,1,1,0,1,1,1,0,0,0,0,0,0,0,0,0,1,1,1,1,1,1,1,0, ,0,0,0,4,4,0,3,0,0,0,3,2,0,0,4,0,0,1,"Nov. 25, 2019",20,25,17,35,23,32,23,22,0,19,11,20,19,13,20,11,19,11,15,14,16,6,39,46,25,18,28,17,11,10,10,18,6,12,5,3,5,2,3,0,3,4,3,2,2,3
212031,2,1,35,1,1,8,1,12,0,1,0,0,0,1,0,0,1,1,0,0,0,0,0,0,0,0,0,0,1,0,0,0,0,0,0, ,1,0,1,0,3,3,3,0,0,0,3,3,4,3,3,0,0,1,"Nov. 24, 2019",24,18,23,42,29,18,29,16,7,24,14,21,17,18,17,55,19,17,12,16,15,18,32,33,45,18,24,30,12,10,14,15,11,11,9,6,3,2,4,1,2,4,2,2,4,2
212033,1,1,49,1,0,8,2,11,0,0,0,0,0,1,0,0,1,1,0,0,0,0,0,0,0,0,0,1,1,0,0,0,0,0,0, ,0,0,0,0,0,0,4,0,0,0,3,0,3,3,0,0,0,2,"Nov. 25, 2019",12,31,14,18,33,18,7,9,0,19,18,19,19,19,16, , , ,16,16,16,13,28,43,30,21,28,26,15,15,12,15,13,14,5,3,3,4,6,0,2,0,1,3,3,4
212034,2,1,46,1,0,5,2,11,0,1,1,1,1,1,0,0,1,1,0,0,0,0,0,0,0,0,0,1,1,1,0,0,0,0,0, ,0,0,0,2,1,3,4,0,0,0,4,0,2,3,2,0,0,1,"Nov. 25, 2019",27,19,26,30,24,30,25,13,0,25,18,26,18,16,16,28,35,19,13,16,16,24,34,31,27,25,22,22,12,10,10,17,10,9,6,6,3,3,3,2,2,2,1,3,2,2
212041,2,1,41,1,1,5,1,11,0,0,1,1,1,1,0,0,1,1,0,0,0,0,1,0,0,0,0,1,0,0,0,0,0,1,0, ,0,0,0,0,0,0,3,0,0,0,4,2,2,0,2,0,0,1,"Dec. 29, 2019",27, , ,40, , ,27, , ,38,13,10,15, , , , , ,9, , , ,32, , ,16, , ,16, , ,23, , ,6, , ,8, , ,4, , ,2, , 
212042,2,2,35,1,1,5,1,13,1,1,1,0,0,1,0,0,1,1,0,0,0,0,0,0,0,0,0,1,1,1,0,0,0,0,0, ,3,3,0,0,3,0,3,3,1,3,3,3,3,0,3,0,3,1,"Dec. 30, 2019",18,21,15,42,32,33,48,20,0,19,12,12,20,17,16, , , ,8,13,15,37,28,33,31,18,25,17,22,11,13,21,15,19,8,8,5,1,1,2,3,2,3,5,4,4
212043,2,2,45,1,1,5,1,14,0,0,0,0,0,1,0,0,1,1,0,0,0,0,0,0,0,0,0,1,1,0,0,0,0,0,0, ,2,0,0,0,2,0,4,4,0,0,0,0,4,0,0,0,0,1,"Dec. 29, 2019",16,13,13,26,19,18,14,16,0,27,16,7,16,15,15,19,29,32,15,16,16,37,37,37,30,21,20,26,14,12,13,12,9,11,3,3,3,5,1,1,2,2,1,3,1,3
212046,1,1,45,1,1,5,1,12,1,1,0,0,0,1,0,0,1,1,0,0,0,0,0,0,0,0,0,1,1,1,0,1,0,0,0, ,0,0,0,2,0,0,4,0,0,0,0,0,2,0,0,0,0,2,"Dec. 30, 2019",10,13,14,18,17,15,0,15,0,24, , ,16,16,17,20,30,25,16,16,16,16,43,45,32,21,28,26,11,10,12,6,11,12,3,4,3, , , , , , , , , 
212048,2,2,43,1,1,5,1,11,0,1,1,0,0,0,0,0,1,1,0,1,0,0,0,0,0,0,0,0,0,0,0,0,0,1,0, ,0,0,0,0,3,0,3,0,0,0,0,0,2,0,0,0,0,1,"Dec. 30, 2019",26,11,16,51,20,28,49,1,0,20,6,14,18,13,10,32,19,24,11,16,16,30,34,50,31,25,30,23,20,12,12,17,12,17,5,3,5,6,7,5,6,6,5,1,4,5
212052,1,1,25,1,1,5,2,10,0,0,1,0,0,1,0,0,1,1,0,0,0,0,0,0,0,0,0,1,1,1,0,1,0,1,0, ,1,2,0,3,3,3,3,0,0,0,4,3,2,2,1,0,0,2,"Dec. 31, 2019",20,19,11,25,24,19,26,0,0,18,1,4,16,15,15, , , ,12,16,16,25,37,29,31,24,20,20,14,12,12,17,15,10,5,6,7,0,0,4,3,2,3,3,3,4
212053,1,1,34,1,0,4,2,11,0,0,0,0,0,1,0,0,1,1,0,0,0,0,0,0,0,0,0,1,0,0,0,0,0,0,0, ,0,0,0,0,0,0,4,0,0,4,0,0,3,3,0,0,0,2,"Dec. 31, 2019",24,18,13,27,26,24,26,0,9,21,6,2,17,16,16, , , ,15,16,16,120,24,22,41,21,22, ,10,14,10,18,21,11,8,6,5,6,7,2,2,1,2,3,2,3
212054,2,1,30,1,0,5,2,10,0,1,1,0,0,1,0,0,1,1,0,0,0,0,0,0,0,0,0,1,1,1,0,0,0,0,0, ,4,0,4,0,4,4,4,0,0,3,4,3,4,0,4,0,0,1,"Dec. 31, 2019",26,30,28,39,33,46,49,0,37,31,10,22,15,16,17,46,25,35,9,16,13,34,38,30,34,27,22,27,17,14,18,13,13,15,6,6,4,4,2,1,3,2,6,2,3,3
212055,1,1,40,1,1,4,1,12,1,1,0,0,0,1,0,0,1,1,0,0,0,0,0,0,0,0,0,1,1,1,0,0,0,0,0, ,2,2,0,0,2,2,3,3,0,0,2,2,3,2,2,0,2,2,"Dec. 30, 2019",16,14, ,33,26, ,9,4, ,21,18,21,15,20, ,37,19, ,13,16, , ,35,26, ,25,21, ,10,12, ,15,15, ,4,5, ,3, , ,3, , ,2, , 
212056,2,1,39,1,0,5,2,11,0,1,0,0,0,1,1,1,1,1,0,0,0,0,0,0,0,0,0,1,1,0,0,0,0,1,0, ,0,3,0,2,4,0,3,3,0,0,3,3,3,2,3,0,0,1,"Dec. 31, 2019",28, , ,43, , ,29, , ,19,17,5,20, , , , , ,15, , , ,41, , ,25, , ,10, , ,17, , ,3, , ,2, , ,2, , ,4, , 
212057,2,2,48,1,1,7,1,11,0,1,0,0,0,1,0,0,1,1,0,0,0,0,0,0,0,0,0,1,1,1,0,0,0,0,0, ,0,0,0,0,3,3,4,0,0,0,0,0,4,3,3,0,3,1,"Jan. 6, 2020",26,22,25,42,34,40,33,12,0,23,27,19,20,12,11,24,25,20,13,16,9,25,35,34,23,24,23,27,16,12,14,19,8,21,5,4,3, ,2,5, ,2,3,3,2,5
213001,1,1,34,1,0,9,2,11,0,1,1,1,0,1,0,0,1,1,0,0,0,0,0,0,0,1,0,1,1,1,0,0,0,0,0, ,2,0,0,2,2,3,3,0,0,0,0,3,3,3,2,0,0,2,"Nov. 18, 2019",29,27,22,27,30,24,43,31,0,33,21,27,17,11,15,20,17,14,16,14,16,20,34,37,18,24,27,21,10,12,11,13,17,10,8,9,5,6,3,4,3,4,2,4,4,2
213002,1,1,44,1,2,5,1,14,0,1,1,0,0,1,0,0,1,1,0,0,0,0,0,0,0,0,0,1,1,1,0,0,0,0,0, ,1,3,0,3,2,0,3,0,0,0,4,3,2,3,3,0,0,2,"Nov. 17, 2019",20,21,14,35,34,24,36,25,10,17,15, ,18,14,15,19,26,22,16,15,16,21,29,33,23,22,21,15,17,15,13,14,20,11,9,8,4,5, ,4,5, ,5,9, ,4
213003,1,1,34,1,1,5,1,11,0,1,1,1,0,1,0,0,1,1,0,0,0,0,0,0,0,1,0,1,1,1,0,0,0,1,0, ,0,3,0,3,3,4,4,0,0,0,4,3,3,3,0,0,0,2,"Nov. 18, 2019",22,16,19,23,23,30,22,13,0,22, , ,19,14,11,23,22,24,16,16,15,25,38,47,40, ,24,29,10,12,11,11,11,16,3,5,7,6,5,4,3,3,2,6,5,4
213005,2,1,42,1,1,6,2,13,1,1,1,1,0,1,0,0,1,1,0,0,0,0,0,0,0,1,1,1,1,1,0,0,0,0,0, ,4,4,0,2,3,4,4,0,0,0,4,3,3,3,2,0,0,1,"Nov. 17, 2019",25,14,28,39,23,38,28,9,20,17,11,14,19,15,17,34,33,36,16,16,16,29,35,47,32,23,30,25,10,10,13,12,14,9,3,3,7,5,3,4,6,2,2,6,2,4
213006,1,1,34,1,0,4,2,11,0,1,1,1,0,1,0,0,1,1,0,0,0,0,0,0,0,1,0,1,1,1,0,0,0,0,0, ,0,0,0,3,0,0,3,0,0,0,4,3,3,3,1,0,0,2,"Nov. 18, 2019",27,28,17,33,31,20,25,18,0,22,10,12,20,20,16,21,27,24,16,16,16,25,32,22,29,22,24,21,10,10,14,10,6,10,3,3,3,4,0,1,3,2,3,3,2,2
213007,2,1,36,1,2,7,2,12,1,1,1,0,0,1,0,0,1,1,0,0,0,0,0,0,0,1,0,1,1,1,0,0,0,0,0, ,0,0,0,4,4,4,4,0,0,0,4,3,3,3,1,0,0,1,"Nov. 17, 2019",16,14,30,20,24,18,18,10,0,17,18,4,18,17,16,21,15,11,16,15,16,31,34,39,24,25,24,24,10,10,10,10,18,15,3,5,5,3,3,3,4,5,2,4,2,5
213008,1,1,38,1,1,5,2,10,0,1,0,1,0,1,0,0,1,1,0,0,0,0,0,0,0,1,1,1,1,1,0,0,0,0,0, ,3,0,0,3,3,4,3,0,0,0,4,2,2,2,0,0,0,2,"Nov. 19, 2019",25,24,37,38,22,53,24,0,7,19,8,16,8,3,3, , , ,16,16,12,24,33,36,20,24,27,22,10,12,13,12,16,12,6,5,6,3,2,3,4,2,3,5,3,4
213009,1,1,53,1,0,5,2,11,0,1,0,0,0,0,0,0,1,1,0,0,0,0,0,0,0,0,0,1,1,1,0,0,0,0,0, ,2,0,0,3,3,3,3,0,0,0,3,3,3,3,0,0,0,2,"Nov. 19, 2019",29,29,22,38,47,33,43,29,0,22,2,22,20,18,12,29,46,23,16,13,9,30,34,38,32,21,25,21,10,10,12,10,9,12,6,5,5,5,6,6,5,4,5,4,6,5
213011,2,1,33,1,1,4,2,10,0,1,0,0,0,1,0,0,1,1,0,0,0,0,0,0,0,0,0,1,1,1,0,0,0,0,0, ,0,0,2,2,2,0,2,0,0,0,4,2,2,2,1,0,0,1,"Nov. 20, 2019",19,11,10,30,16,15,24,0,0,27,30,8,18,10,10,24,35,22,16,16,16,4,33,35,25,23,21,20,10,10,14,10,12,12,4,3,5,2,1,5,4,2,3,5,2,2
213012,1,1,25,1,1,5,1,14,0,1,1,0,0,1,0,0,1,1,0,0,0,0,0,0,0,1,0,1,1,1,1,0,0,1,0, ,0,0,4,4,4,0,4,0,0,0,4,4,4,3,3,0,0,2,"Nov. 17, 2019",29,33, ,26,34, ,43,22, ,26,10,16,19,18, ,33,51, ,16,16, , ,34,40, ,25,26, ,11,12, ,10,16, ,5,5, ,7,3, ,3,3, ,4,4, 
213013,2,1,34,1,2,5,2,11,0,1,0,0,0,1,0,0,1,1,0,0,0,0,0,0,0,1,0,1,1,1,0,0,0,0,0, ,0,0,0,2,3,3,0,0,0,0,2,3,3,3,1,0,0,1,"Nov. 18, 2019",17, , ,26, , ,18, , ,23,8,28,18, , ,25, , ,16, , , ,34, , ,24, , ,10, , ,13, , ,6, , ,1, , ,4, , ,4, , 
213014,2,1,29,2,2,7,2,12,0,1,1,1,0,1,1,0,1,1,0,1,0,0,0,0,0,0,0,1,1,0,0,0,0,1,0, ,2,2,1,4,4,4,4,0,0,0,0,3,3,3,2,0,0,1,"Nov. 18, 2019",17,28,15,27,39,18,23,28,8,20,34,16,20,14,15,23,34,25,16,11,16,27,33,24,42,21,20,27,14,10,10,16,12,10,7,6,4,3,3,3,1,3,0,6,2,3
213015,1,1,34,1,2,4,1,12,0,1,0,0,0,1,0,0,1,1,0,0,0,0,0,0,0,0,0,1,0,1,0,0,0,0,0, ,1,0,0,2,3,0,3,0,0,0,4,3,2,2,0,0,0,2,"Nov. 19, 2019",25,23,16,35,37,25,41,11,0,25,0,2,17,18,11, , , ,16,16,10,27,39,49,46,26,30,26,13,12,14,11,15,13,7,9,8,6,6,5,4,3,5,4,2,5
213016,1,1,43,1,0,4,1,13,0,1,0,0,0,1,0,0,1,1,0,0,0,0,0,0,0,0,0,1,1,0,0,0,0,0,0, ,0,0,0,2,2,2,0,0,0,0,0,3,3,2,2,0,0,2,"Nov. 19, 2019",29,29,21,31,45,23,19,18,5,23,29, ,19,12,13, , , ,16,16,16,30,34,17,31,23,23,18,11,10,12,13,14,12,3,5,6,4,3,2,3,3,2,2,3,2
213017,1,1,37,1,2,5,2,10,0,1,1,1,0,1,0,0,1,1,0,0,0,0,0,0,0,0,0,1,1,1,0,0,0,0,0, ,3,0,0,3,3,0,3,0,1,0,0,3,2,2,1,0,0,2,"Nov. 19, 2019",26,27,27,37,37,37,0,0,0,17, , ,18,9,9,19,16,29,15,9,16,26,39,23,25,24,21,19,12,11,12,14,18,21,6,7,7,4,6,7,4,3,2,2,4,3