﻿Record ID,Disease topic,Date of Twitter user message,Date of contact message,Contact acknowledged solicitation within 10 days.,Date contact acknowledged solicitation,"Private or public response message sent by prospective participant on Twitter, regardless of interest in participating in clinical trial (choice=Private)","Private or public response message sent by prospective participant on Twitter, regardless of interest in participating in clinical trial (choice=Public (Twitter Reply))",Twitter User Actions after outreach message (choice=Liked outreach tweet),Twitter User Actions after outreach message (choice=Retweeted outreach tweet),Twitter User Actions after outreach message (choice=Blocked our account),Twitter user following team account,"Cancer survivor (ie, Twitter user message indicated Twitter user is affected by cancer)",Twitter message indicated person affected by cancer is family member or friend,Twitter message indicated person affected by cancer is unclear,Twitter User Actions after additional message (if applicable) (choice=Liked),Twitter User Actions after additional message (if applicable) (choice=Replied),Contacted us due to interest in trial?,Contacted us for trial via (choice=Contact Form (private)),"Contacted us for trial via (choice=Public (e.g. public reply, mention))",Contacted us for trial via (choice=Direct Message (private)),Contacted us for trial via (choice=Email (private)),Contacted us for trial via (choice=Phone (private)),Person is deceased?,Twitter message confirming person is deceased,Twitter message URL confirming person is deceased,Date when we sent a request (either via email or direct message) to schedule a pre-screening phone call,Date of outreach phone call,Date when triage email to USC Norris was sent,Date of USC Norris team follow-up (if applicable),Is the contacted person a cancer patient? (Based on Twitter profile description or previous Twitter messages.),Type of cancer contact was diagnosed with (based on Twitter profile description or previous Twitter messages),Is the contacted person eligible for one of the trials? (based on pre-screening via phone),Gender
1,Lymphoma,1/5/2018,2/14/2018,Yes,2/15/2018,Unchecked,Checked,Checked,Unchecked,Unchecked,,Checked,Unchecked,Unchecked,Unchecked,Unchecked,Yes,Checked,Unchecked,Unchecked,Unchecked,Unchecked,No,,,3/1/2018,3/5/2018,3/2/2018,,Yes,Lymphoma,No,Female
2,Lymphoma,1/4/2018,2/14/2018,No,,Unchecked,Unchecked,Checked,Unchecked,Unchecked,,Unchecked,Checked,Unchecked,Unchecked,Unchecked,,Unchecked,Unchecked,Unchecked,Unchecked,Unchecked,,,,,,,,,,,
3,Lymphoma,12/27/2017,2/14/2018,No,,Unchecked,Unchecked,Unchecked,Unchecked,Unchecked,,Checked,Unchecked,Unchecked,Unchecked,Unchecked,,Unchecked,Unchecked,Unchecked,Unchecked,Unchecked,,,,,,,,,,,
4,Lymphoma,12/22/2017,2/14/2018,Yes,2/14/2018,Checked,Unchecked,Unchecked,Unchecked,Unchecked,,Unchecked,Unchecked,Checked,Unchecked,Unchecked,No,Unchecked,Unchecked,Unchecked,Unchecked,Unchecked,,,,,,,,No,,,
5,Lymphoma,12/19/2017,2/14/2018,No,,Unchecked,Unchecked,Unchecked,Unchecked,Unchecked,,Checked,Unchecked,Unchecked,Unchecked,Unchecked,,Unchecked,Unchecked,Unchecked,Unchecked,Unchecked,,,,,,,,,,,
6,Lymphoma,12/18/2017,2/14/2018,Yes,2/14/2018,Unchecked,Checked,Checked,Unchecked,Unchecked,Yes,Unchecked,Checked,Unchecked,Unchecked,Unchecked,,Unchecked,Unchecked,Unchecked,Unchecked,Unchecked,,,,,,,,,,,Female
7,Lymphoma,1/10/2018,2/22/2018,,,Unchecked,Unchecked,Unchecked,Unchecked,Unchecked,,Unchecked,Unchecked,Checked,Unchecked,Unchecked,,Unchecked,Unchecked,Unchecked,Unchecked,Unchecked,,,,,,,,,,,
9,Lymphoma,1/19/2018,2/22/2018,,,Unchecked,Unchecked,Unchecked,Unchecked,Unchecked,,Unchecked,Checked,Unchecked,Unchecked,Unchecked,,Unchecked,Unchecked,Unchecked,Unchecked,Unchecked,,,,,,,,,,,
11,Lymphoma,1/28/2018,2/22/2018,,,Unchecked,Unchecked,Unchecked,Unchecked,Unchecked,,Unchecked,Checked,Unchecked,Unchecked,Unchecked,,Unchecked,Unchecked,Unchecked,Unchecked,Unchecked,,,,,,,,,,,
12,Lymphoma,1/27/2018,2/22/2018,Yes,,Unchecked,Unchecked,Unchecked,Unchecked,Checked,,Unchecked,Checked,Unchecked,Unchecked,Unchecked,,Unchecked,Unchecked,Unchecked,Unchecked,Unchecked,,,,,,,,,,,
13,Lymphoma,1/7/2018,3/2/2018,,,Unchecked,Unchecked,Unchecked,Unchecked,Unchecked,,Checked,Unchecked,Unchecked,Unchecked,Unchecked,,Unchecked,Unchecked,Unchecked,Unchecked,Unchecked,,,,,,,,,,,
14,Lymphoma,2/4/2018,3/6/2018,,,Unchecked,Unchecked,Unchecked,Unchecked,Unchecked,,Checked,Unchecked,Unchecked,Unchecked,Unchecked,,Unchecked,Unchecked,Unchecked,Unchecked,Unchecked,,,,,,,,,,,
15,Lymphoma,2/4/2018,3/6/2018,,,Unchecked,Unchecked,Unchecked,Unchecked,Unchecked,,Checked,Unchecked,Unchecked,Unchecked,Unchecked,,Unchecked,Unchecked,Unchecked,Unchecked,Unchecked,,,,,,,,,,,
16,Lymphoma,2/8/2018,3/6/2018,,,Unchecked,Unchecked,Unchecked,Unchecked,Unchecked,,Checked,Unchecked,Unchecked,Unchecked,Unchecked,,Unchecked,Unchecked,Unchecked,Unchecked,Unchecked,,,,,,,,,,,
17,Lymphoma,2/9/2018,3/6/2018,,,Unchecked,Unchecked,Unchecked,Unchecked,Unchecked,,Unchecked,Checked,Unchecked,Unchecked,Unchecked,,Unchecked,Unchecked,Unchecked,Unchecked,Unchecked,,,,,,,,,,,
18,Lymphoma,2/12/2018,3/6/2018,,,Unchecked,Unchecked,Unchecked,Unchecked,Unchecked,,Checked,Unchecked,Unchecked,Unchecked,Unchecked,,Unchecked,Unchecked,Unchecked,Unchecked,Unchecked,,,,,,,,,,,
19,Lymphoma,2/12/2018,3/6/2018,,,Unchecked,Unchecked,Unchecked,Unchecked,Unchecked,,Unchecked,Checked,Unchecked,Unchecked,Unchecked,,Unchecked,Unchecked,Unchecked,Unchecked,Unchecked,,,,,,,,,,,
20,Lymphoma,2/27/2018,3/6/2018,,,Unchecked,Unchecked,Unchecked,Unchecked,Unchecked,,Checked,Unchecked,Unchecked,Unchecked,Unchecked,,Unchecked,Unchecked,Unchecked,Unchecked,Unchecked,,,,,,,,,,,
21,Lymphoma,2/25/2018,3/6/2018,,,Unchecked,Unchecked,Unchecked,Unchecked,Unchecked,,Checked,Unchecked,Unchecked,Unchecked,Unchecked,,Unchecked,Unchecked,Unchecked,Unchecked,Unchecked,,,,,,,,,,,
22,Lymphoma,2/24/2018,3/6/2018,,,Unchecked,Unchecked,Unchecked,Unchecked,Unchecked,,Unchecked,Checked,Unchecked,Unchecked,Unchecked,,Unchecked,Unchecked,Unchecked,Unchecked,Unchecked,,,,,,,,,,,
23,Kidney cancer,2/6/2018,3/6/2018,,,Unchecked,Unchecked,Checked,Unchecked,Unchecked,,Checked,Unchecked,Unchecked,Unchecked,Unchecked,,Checked,Unchecked,Unchecked,Unchecked,Unchecked,,,,3/6/2018,3/8/2018,3/7/2018,3/15/2018,,Kidney cancer,Yes,Male
24,Kidney cancer,2/23/2018,3/6/2018,,,Unchecked,Unchecked,Unchecked,Unchecked,Unchecked,,Unchecked,Checked,Unchecked,Unchecked,Unchecked,,Unchecked,Unchecked,Unchecked,Unchecked,Unchecked,,,,,,,,,,,
25,Lymphoma,3/3/2018,3/15/2018,,,Unchecked,Unchecked,Checked,Unchecked,Unchecked,,Unchecked,Checked,Unchecked,Unchecked,Unchecked,,Unchecked,Unchecked,Unchecked,Unchecked,Unchecked,,,,,,,,,,,
26,Lymphoma,2/28/2018,3/15/2018,,,Unchecked,Unchecked,Unchecked,Unchecked,Unchecked,,Checked,Unchecked,Unchecked,Unchecked,Unchecked,,Unchecked,Unchecked,Unchecked,Unchecked,Unchecked,,,,,,,,,,,
27,Colon cancer,1/19/2018,3/15/2018,,,Unchecked,Unchecked,Unchecked,Unchecked,Unchecked,,Checked,Unchecked,Unchecked,Unchecked,Unchecked,,Unchecked,Unchecked,Unchecked,Unchecked,Unchecked,,,,,,,,,,,
28,Colon cancer,1/18/2018,3/15/2018,Yes,3/16/2018,Unchecked,Checked,Unchecked,Unchecked,Unchecked,Yes,Checked,Unchecked,Unchecked,Unchecked,Unchecked,Yes,Checked,Checked,Unchecked,Unchecked,Unchecked,,,,,,,,,,,Male
29,Colon cancer,1/26/2018,3/15/2018,,,Unchecked,Unchecked,Unchecked,Unchecked,Unchecked,,Unchecked,Checked,Unchecked,Unchecked,Unchecked,,Unchecked,Unchecked,Unchecked,Unchecked,Unchecked,,,,,,,,,,,
30,Colon cancer,1/25/2018,3/15/2018,,,Unchecked,Unchecked,Unchecked,Unchecked,Unchecked,,Unchecked,Checked,Unchecked,Unchecked,Unchecked,,Unchecked,Unchecked,Unchecked,Unchecked,Unchecked,,,,,,,,,,,
31,Colon cancer,1/24/2018,3/15/2018,,,Unchecked,Unchecked,Unchecked,Unchecked,Unchecked,,Checked,Unchecked,Unchecked,Unchecked,Unchecked,,Unchecked,Unchecked,Unchecked,Unchecked,Unchecked,,,,,,,,,,,
32,Colon cancer,2/12/2018,3/15/2018,,,Unchecked,Unchecked,Unchecked,Unchecked,Unchecked,,Unchecked,Checked,Unchecked,Unchecked,Unchecked,,Unchecked,Unchecked,Unchecked,Unchecked,Unchecked,,,,,,,,,,,
33,Colon cancer,2/11/2018,3/15/2018,Yes,3/15/2018,Checked,Unchecked,Checked,Unchecked,Unchecked,Yes,Checked,Unchecked,Unchecked,Unchecked,Unchecked,Yes,Unchecked,Unchecked,Checked,Unchecked,Unchecked,No,,,3/16/2018,3/26/2018,3/16/2018,3/26/2018,Yes,Colon cancer,No,Female
34,Colon cancer,2/21/2018,3/15/2018,,,Unchecked,Unchecked,Checked,Unchecked,Unchecked,,Unchecked,Checked,Unchecked,Unchecked,Unchecked,,Unchecked,Unchecked,Unchecked,Unchecked,Unchecked,,,,,,,,,,,
35,Colon cancer,2/21/2018,3/15/2018,Yes,3/16/2018,Unchecked,Unchecked,Unchecked,Unchecked,Checked,,Checked,Unchecked,Unchecked,Unchecked,Unchecked,,Unchecked,Unchecked,Unchecked,Unchecked,Unchecked,,,,,,,,,,,
36,Colon cancer,3/3/2018,3/16/2018,,,Unchecked,Unchecked,Unchecked,Unchecked,Unchecked,,Unchecked,Checked,Unchecked,Unchecked,Unchecked,,Unchecked,Unchecked,Unchecked,Unchecked,Unchecked,,,,,,,,,,,
37,Colon cancer,3/12/2018,3/16/2018,,,Unchecked,Unchecked,Unchecked,Unchecked,Unchecked,,Checked,Unchecked,Unchecked,Unchecked,Unchecked,,Unchecked,Unchecked,Unchecked,Unchecked,Unchecked,,,,,,,,,,,
38,Colon cancer,1/31/2018,3/16/2018,,,Unchecked,Unchecked,Unchecked,Unchecked,Checked,,Unchecked,Checked,Unchecked,Unchecked,Unchecked,,Unchecked,Unchecked,Unchecked,Unchecked,Unchecked,,,,,,,,,,,
39,Lymphoma,12/18/2017,3/26/2018,,,Unchecked,Unchecked,Unchecked,Unchecked,Unchecked,,Unchecked,Checked,Unchecked,Unchecked,Unchecked,,Unchecked,Unchecked,Unchecked,Unchecked,Unchecked,,,,,,,,,,,
40,Lymphoma,12/14/2017,3/26/2018,,,Unchecked,Unchecked,Unchecked,Unchecked,Unchecked,,Unchecked,Checked,Unchecked,Unchecked,Unchecked,,Unchecked,Unchecked,Unchecked,Unchecked,Unchecked,,,,,,,,,,,
41,Lymphoma,12/12/2017,3/26/2018,,,Unchecked,Unchecked,Unchecked,Unchecked,Unchecked,,Unchecked,Checked,Unchecked,Unchecked,Unchecked,,Unchecked,Unchecked,Unchecked,Unchecked,Unchecked,,,,,,,,,,,
42,Lymphoma,12/9/2017,3/26/2018,,,Unchecked,Unchecked,Checked,Checked,Unchecked,Yes,Unchecked,Checked,Unchecked,Unchecked,Unchecked,,Unchecked,Unchecked,Unchecked,Unchecked,Unchecked,,,,,,,,,,,
43,Lymphoma,12/4/2017,3/26/2018,Yes,3/26/2018,Unchecked,Unchecked,Checked,Unchecked,Unchecked,,Checked,Unchecked,Unchecked,Unchecked,Unchecked,,Checked,Unchecked,Unchecked,Unchecked,Unchecked,,,,,,,,,,,
44,Lymphoma,12/2/2017,3/26/2018,,,Unchecked,Unchecked,Unchecked,Unchecked,Unchecked,,Unchecked,Checked,Unchecked,Unchecked,Unchecked,,Unchecked,Unchecked,Unchecked,Unchecked,Unchecked,,,,,,,,,,,
45,Lymphoma,11/30/2017,3/26/2018,,,Unchecked,Unchecked,Unchecked,Unchecked,Unchecked,,Checked,Unchecked,Unchecked,Unchecked,Unchecked,,Unchecked,Unchecked,Unchecked,Unchecked,Unchecked,,,,,,,,,,,
46,Lymphoma,11/30/2017,3/26/2018,,4/3/2018,Checked,Unchecked,Unchecked,Unchecked,Unchecked,,Checked,Unchecked,Unchecked,Unchecked,Unchecked,Yes,Checked,Unchecked,Checked,Unchecked,Unchecked,No,,,4/3/2018,,,,,,,
47,Lymphoma,11/27/2017,3/26/2018,,,Unchecked,Unchecked,Unchecked,Unchecked,Unchecked,Yes,Unchecked,Checked,Unchecked,Unchecked,Unchecked,,Unchecked,Unchecked,Unchecked,Unchecked,Unchecked,,,,,,,,,,,
48,Lymphoma,11/23/2017,3/26/2018,,,Unchecked,Unchecked,Unchecked,Unchecked,Unchecked,,Unchecked,Checked,Unchecked,Unchecked,Unchecked,,Unchecked,Unchecked,Unchecked,Unchecked,Unchecked,,,,,,,,,,,
49,Lymphoma,10/23/2017,3/26/2018,,,Unchecked,Unchecked,Unchecked,Unchecked,Unchecked,,Unchecked,Checked,Unchecked,Unchecked,Unchecked,,Unchecked,Unchecked,Unchecked,Unchecked,Unchecked,,,,,,,,,,,
50,Lymphoma,10/19/2017,3/26/2018,,,Unchecked,Unchecked,Unchecked,Unchecked,Unchecked,,Checked,Unchecked,Unchecked,Unchecked,Unchecked,,Unchecked,Unchecked,Unchecked,Unchecked,Unchecked,,,,,,,,,,,
51,Lymphoma,9/22/2017,3/26/2018,,,Unchecked,Unchecked,Unchecked,Unchecked,Unchecked,,Unchecked,Checked,Unchecked,Unchecked,Unchecked,,Unchecked,Unchecked,Unchecked,Unchecked,Unchecked,Yes,He died.,https://twitter.com/SazeracLA/status/978313560727093248,,,,,,,,
52,Lymphoma,9/19/2017,3/26/2018,,,Unchecked,Unchecked,Unchecked,Unchecked,Unchecked,,Checked,Unchecked,Unchecked,Unchecked,Unchecked,,Unchecked,Unchecked,Unchecked,Unchecked,Unchecked,,,,,,,,,,,
53,Lymphoma,8/15/2017,3/26/2018,,,Unchecked,Unchecked,Unchecked,Unchecked,Unchecked,,Unchecked,Checked,Unchecked,Unchecked,Unchecked,,Unchecked,Unchecked,Unchecked,Unchecked,Unchecked,,,,,,,,,,,
54,Lymphoma,8/11/2017,3/26/2018,,,Unchecked,Unchecked,Checked,Unchecked,Unchecked,,Unchecked,Checked,Unchecked,Unchecked,Unchecked,,Unchecked,Unchecked,Unchecked,Unchecked,Unchecked,,,,,,,,,,,
55,Lymphoma,10/7/2017,3/26/2018,,,Unchecked,Unchecked,Unchecked,Unchecked,Unchecked,,Unchecked,Checked,Unchecked,Unchecked,Unchecked,,Unchecked,Unchecked,Unchecked,Unchecked,Unchecked,,,,,,,,,,,
56,Lymphoma,9/30/2017,3/26/2018,,,Unchecked,Unchecked,Unchecked,Unchecked,Checked,,Unchecked,Checked,Unchecked,Unchecked,Unchecked,,Unchecked,Unchecked,Unchecked,Unchecked,Unchecked,,,,,,,,,,,
57,Lymphoma,8/15/2017,3/26/2018,,,Unchecked,Unchecked,Unchecked,Unchecked,Unchecked,,Unchecked,Checked,Unchecked,Unchecked,Unchecked,,Unchecked,Unchecked,Unchecked,Unchecked,Unchecked,,,,,,,,,,,
58,Lymphoma,12/9/2017,3/26/2018,,,Unchecked,Unchecked,Unchecked,Unchecked,Checked,,Checked,Unchecked,Unchecked,Unchecked,Unchecked,,Unchecked,Unchecked,Unchecked,Unchecked,Unchecked,,,,,,,,,,,
59,Lymphoma,8/10/2017,3/26/2018,,,Unchecked,Checked,Unchecked,Unchecked,Unchecked,,Unchecked,Checked,Unchecked,Checked,Unchecked,,Unchecked,Unchecked,Unchecked,Unchecked,Unchecked,,,,,,,,,,,
60,Lymphoma,8/10/2017,3/26/2018,,,Unchecked,Unchecked,Unchecked,Unchecked,Unchecked,,Unchecked,Checked,Unchecked,Unchecked,Unchecked,,Unchecked,Unchecked,Unchecked,Unchecked,Unchecked,,,,,,,,,,,
61,Kidney cancer,11/28/2017,3/26/2018,,,Unchecked,Unchecked,Unchecked,Unchecked,Unchecked,,Checked,Unchecked,Unchecked,Unchecked,Unchecked,,Unchecked,Unchecked,Unchecked,Unchecked,Unchecked,,,,,,,,,,,
62,Kidney cancer,11/9/2017,3/26/2018,,,Unchecked,Unchecked,Unchecked,Unchecked,Unchecked,,Unchecked,Checked,Unchecked,Unchecked,Unchecked,,Unchecked,Unchecked,Unchecked,Unchecked,Unchecked,,,,,,,,,,,
63,Colon cancer,1/7/2018,3/26/2018,,,Unchecked,Unchecked,Unchecked,Unchecked,Unchecked,,Unchecked,Checked,Unchecked,Unchecked,Unchecked,,Unchecked,Unchecked,Unchecked,Unchecked,Unchecked,,,,,,,,,,,
64,Colon cancer,12/8/2017,3/26/2018,Yes,3/26/2018,Checked,Unchecked,Unchecked,Unchecked,Unchecked,,Checked,Unchecked,Unchecked,Unchecked,Unchecked,Yes,Checked,Unchecked,Unchecked,Unchecked,Unchecked,No,,,3/26/2018,3/28/2018,3/29/2018,4/9/2018,Yes,Colon cancer,Yes,Male
65,Colon cancer,12/7/2017,3/26/2018,,,Unchecked,Unchecked,Unchecked,Unchecked,Unchecked,,Unchecked,Checked,Unchecked,Unchecked,Unchecked,,Unchecked,Unchecked,Unchecked,Unchecked,Unchecked,,,,,,,,,,,
66,Colon cancer,12/3/2017,3/26/2018,,,Unchecked,Unchecked,Unchecked,Unchecked,Unchecked,,Unchecked,Checked,Unchecked,Unchecked,Unchecked,,Unchecked,Unchecked,Unchecked,Unchecked,Unchecked,,,,,,,,,,,
67,Colon cancer,11/20/2017,3/26/2018,,,Unchecked,Unchecked,Unchecked,Unchecked,Unchecked,,Unchecked,Checked,Unchecked,Unchecked,Unchecked,,Unchecked,Unchecked,Unchecked,Unchecked,Unchecked,,,,,,,,,,,
68,Colon cancer,10/20/2017,3/26/2018,,,Unchecked,Checked,Unchecked,Unchecked,Unchecked,,Unchecked,Checked,Unchecked,Checked,Checked,No,Unchecked,Unchecked,Unchecked,Unchecked,Unchecked,Yes,Thank you for reaching out. My mother had colorectal cancer/ was a survivor - my husband was a non-smoker dx 5 yrs ago w/ stage 4 lung cancer/USC patient/participated in 2 clinical trials wJorge Nieva/Cynthia Martel /my husband passed away 2 mos ago after 6 lines of treatment.,https://twitter.com/ChancesR3/status/978405641038397440,,,,,,,,
69,Colon cancer,10/14/2017,3/26/2018,,,Unchecked,Unchecked,Unchecked,Unchecked,Unchecked,,Unchecked,Checked,Unchecked,Unchecked,Unchecked,,Unchecked,Unchecked,Unchecked,Unchecked,Unchecked,,,,,,,,,,,
70,Colon cancer,10/14/2017,3/26/2018,,,Unchecked,Unchecked,Unchecked,Unchecked,Unchecked,,Unchecked,Checked,Unchecked,Unchecked,Unchecked,,Unchecked,Unchecked,Unchecked,Unchecked,Unchecked,,,,,,,,,,,
71,Colon cancer,9/26/2017,3/26/2018,,,Unchecked,Unchecked,Unchecked,Unchecked,Unchecked,,Unchecked,Checked,Unchecked,Unchecked,Unchecked,,Unchecked,Unchecked,Unchecked,Unchecked,Unchecked,,,,,,,,,,,
72,Colon cancer,9/24/2017,3/26/2018,,,Unchecked,Unchecked,Unchecked,Unchecked,Unchecked,,Unchecked,Checked,Unchecked,Unchecked,Unchecked,Yes,Checked,Checked,Unchecked,Unchecked,Unchecked,,,,,,,,,,,
73,Colon cancer,9/24/2017,3/26/2018,,,Unchecked,Unchecked,Unchecked,Unchecked,Unchecked,,Unchecked,Checked,Unchecked,Unchecked,Unchecked,,Unchecked,Unchecked,Unchecked,Unchecked,Unchecked,,,,,,,,,,,
74,Colon cancer,9/5/2017,3/26/2018,,,Unchecked,Unchecked,Unchecked,Unchecked,Unchecked,,Unchecked,Checked,Unchecked,Unchecked,Unchecked,,Unchecked,Unchecked,Unchecked,Unchecked,Unchecked,,,,,,,,,,,
75,Colon cancer,8/18/2017,3/26/2018,,,Unchecked,Unchecked,Unchecked,Unchecked,Unchecked,,Unchecked,Checked,Unchecked,Unchecked,Unchecked,,Unchecked,Unchecked,Unchecked,Unchecked,Unchecked,,,,,,,,,,,
76,Colon cancer,8/8/2017,3/26/2018,,,Unchecked,Unchecked,Unchecked,Unchecked,Unchecked,,Checked,Unchecked,Unchecked,Unchecked,Unchecked,,Unchecked,Unchecked,Unchecked,Unchecked,Unchecked,,,,,,,,,,,
77,Colon cancer,7/29/2017,3/26/2018,,,Unchecked,Unchecked,Unchecked,Unchecked,Unchecked,,Unchecked,Checked,Unchecked,Unchecked,Unchecked,,Unchecked,Unchecked,Unchecked,Unchecked,Unchecked,,,,,,,,,,,
78,Kidney cancer,11/25/2017,3/26/2018,,,Unchecked,Unchecked,Unchecked,Unchecked,Unchecked,,Unchecked,Checked,Unchecked,Unchecked,Unchecked,,Unchecked,Unchecked,Unchecked,Unchecked,Unchecked,,,,,,,,,,,
79,Kidney cancer,11/4/2017,3/26/2018,,3/26/2018,Unchecked,Checked,Unchecked,Unchecked,Unchecked,,Unchecked,Checked,Unchecked,Unchecked,Unchecked,No,Unchecked,Unchecked,Unchecked,Unchecked,Unchecked,,,,,,,,,,,
80,Kidney cancer,10/6/2017,3/26/2018,,,Unchecked,Unchecked,Unchecked,Unchecked,Unchecked,,Unchecked,Checked,Unchecked,Unchecked,Unchecked,,Unchecked,Unchecked,Unchecked,Unchecked,Unchecked,,,,,,,,,,,
81,Colon cancer,8/9/2017,3/26/2018,,,Unchecked,Unchecked,Unchecked,Unchecked,Unchecked,,Checked,Unchecked,Unchecked,Unchecked,Unchecked,,Unchecked,Unchecked,Unchecked,Unchecked,Unchecked,,,,,,,,,,,
82,Colon cancer,9/21/2017,3/26/2018,,,Unchecked,Unchecked,Unchecked,Unchecked,Unchecked,,Checked,Unchecked,Unchecked,Unchecked,Unchecked,,Unchecked,Unchecked,Unchecked,Unchecked,Unchecked,,,,,,,,,,,
83,Colon cancer,12/4/2017,3/27/2018,,,Unchecked,Unchecked,Unchecked,Unchecked,Unchecked,,Unchecked,Checked,Unchecked,Unchecked,Unchecked,,Unchecked,Unchecked,Unchecked,Unchecked,Unchecked,,,,,,,,,,,
84,Colon cancer,3/17/2018,3/29/2018,,,Unchecked,Unchecked,Unchecked,Unchecked,Unchecked,,Unchecked,Checked,Unchecked,Unchecked,Unchecked,,Unchecked,Unchecked,Unchecked,Unchecked,Unchecked,,,,,,,,,,,
85,Breast cancer,3/20/2018,3/31/2018,,,Unchecked,Unchecked,Unchecked,Unchecked,Unchecked,,Checked,Unchecked,Unchecked,Unchecked,Unchecked,,Unchecked,Unchecked,Unchecked,Unchecked,Unchecked,,,,,,,,,,,
86,Breast cancer,3/20/2018,3/31/2018,,,Unchecked,Unchecked,Unchecked,Unchecked,Unchecked,,Unchecked,Checked,Unchecked,Unchecked,Unchecked,,Unchecked,Unchecked,Unchecked,Unchecked,Unchecked,,,,,,,,,,,
87,Breast cancer,3/20/2018,3/31/2018,,,Unchecked,Unchecked,Unchecked,Unchecked,Unchecked,,Unchecked,Checked,Unchecked,Unchecked,Unchecked,,Unchecked,Unchecked,Unchecked,Unchecked,Unchecked,,,,,,,,,,,
88,Breast cancer,3/19/2018,3/31/2018,,,Unchecked,Unchecked,Unchecked,Unchecked,Unchecked,,Checked,Unchecked,Unchecked,Unchecked,Unchecked,,Unchecked,Unchecked,Unchecked,Unchecked,Unchecked,,,,,,,,,,,
89,Breast cancer,3/18/2018,3/31/2018,Yes,3/31/2018,Unchecked,Checked,Checked,Unchecked,Unchecked,,Checked,Unchecked,Unchecked,Unchecked,Unchecked,No,Unchecked,Unchecked,Unchecked,Unchecked,Unchecked,,,,,,,,,,,
90,Breast cancer,3/16/2018,3/31/2018,Yes,3/31/2018,Unchecked,Checked,Unchecked,Unchecked,Unchecked,Yes,Unchecked,Checked,Unchecked,Unchecked,Unchecked,,Unchecked,Checked,Unchecked,Unchecked,Unchecked,,,,,,,,,,,
91,Breast cancer,3/14/2018,3/31/2018,,,Unchecked,Unchecked,Unchecked,Unchecked,Unchecked,,Checked,Unchecked,Unchecked,Unchecked,Unchecked,,Unchecked,Unchecked,Unchecked,Unchecked,Unchecked,,,,,,,,,,,
92,Breast cancer,3/16/2018,3/31/2018,Yes,3/31/2018,Checked,Unchecked,Unchecked,Unchecked,Unchecked,,Checked,Unchecked,Unchecked,Unchecked,Unchecked,No,Unchecked,Unchecked,Unchecked,Unchecked,Unchecked,,,,,,,,,,,
93,Breast cancer,3/19/2018,3/31/2018,,,Unchecked,Unchecked,Unchecked,Unchecked,Unchecked,,Checked,Unchecked,Unchecked,Unchecked,Unchecked,,Unchecked,Unchecked,Unchecked,Unchecked,Unchecked,,,,,,,,,,,
94,Breast cancer,3/12/2018,4/2/2018,,,Unchecked,Unchecked,Unchecked,Unchecked,Unchecked,,Checked,Unchecked,Unchecked,Unchecked,Unchecked,,Unchecked,Unchecked,Unchecked,Unchecked,Unchecked,,,,,,,,,,,
95,Breast cancer,3/12/2018,4/2/2018,,,Unchecked,Unchecked,Unchecked,Unchecked,Unchecked,,Checked,Unchecked,Unchecked,Unchecked,Unchecked,,Unchecked,Unchecked,Unchecked,Unchecked,Unchecked,,,,,,,,,,,
96,Breast cancer,3/12/2018,4/2/2018,,,Unchecked,Unchecked,Unchecked,Unchecked,Unchecked,,Unchecked,Checked,Unchecked,Unchecked,Unchecked,,Unchecked,Unchecked,Unchecked,Unchecked,Unchecked,,,,,,,,,,,
97,Breast cancer,3/12/2018,4/2/2018,,,Unchecked,Unchecked,Unchecked,Unchecked,Unchecked,,Checked,Unchecked,Unchecked,Checked,Unchecked,,Unchecked,Unchecked,Unchecked,Unchecked,Unchecked,,,,,,,,,,,
98,Breast cancer,3/11/2018,4/2/2018,,,Unchecked,Unchecked,Checked,Unchecked,Unchecked,,Checked,Unchecked,Unchecked,Unchecked,Unchecked,,Unchecked,Unchecked,Unchecked,Unchecked,Unchecked,,,,,,,,,,,
99,Breast cancer,3/5/2018,4/2/2018,,,Unchecked,Unchecked,Unchecked,Unchecked,Unchecked,,Unchecked,Checked,Unchecked,Unchecked,Unchecked,,Unchecked,Unchecked,Unchecked,Unchecked,Unchecked,,,,,,,,,,,
100,Breast cancer,3/5/2018,4/2/2018,,,Unchecked,Unchecked,Checked,Unchecked,Unchecked,,Unchecked,Checked,Unchecked,Checked,Unchecked,,Unchecked,Unchecked,Unchecked,Unchecked,Unchecked,,,,,,,,,,,
101,Breast cancer,3/6/2018,4/2/2018,,,Unchecked,Unchecked,Unchecked,Unchecked,Checked,,Unchecked,Checked,Unchecked,Unchecked,Unchecked,,Unchecked,Unchecked,Unchecked,Unchecked,Unchecked,,,,,,,,,,,
102,Breast cancer,3/5/2018,4/2/2018,,,Unchecked,Unchecked,Unchecked,Unchecked,Unchecked,,Unchecked,Checked,Unchecked,Unchecked,Unchecked,,Unchecked,Unchecked,Unchecked,Unchecked,Unchecked,,,,,,,,,,,
103,Breast cancer,3/1/2018,4/2/2018,,,Unchecked,Unchecked,Unchecked,Unchecked,Unchecked,,Unchecked,Unchecked,Checked,Unchecked,Unchecked,,Unchecked,Unchecked,Unchecked,Unchecked,Unchecked,,,,,,,,,,,
104,Breast cancer,2/27/2018,4/5/2018,,,Unchecked,Unchecked,Unchecked,Unchecked,Unchecked,,Unchecked,Checked,Unchecked,Unchecked,Unchecked,,Unchecked,Unchecked,Unchecked,Unchecked,Unchecked,,,,,,,,,,,
105,Breast cancer,2/25/2018,4/5/2018,,,Unchecked,Unchecked,Unchecked,Unchecked,Unchecked,,Unchecked,Checked,Unchecked,Unchecked,Unchecked,,Unchecked,Unchecked,Unchecked,Unchecked,Unchecked,,,,,,,,,,,
106,Breast cancer,2/24/2018,4/5/2018,,,Unchecked,Unchecked,Unchecked,Unchecked,Unchecked,,Checked,Unchecked,Unchecked,Unchecked,Unchecked,No,Unchecked,Unchecked,Unchecked,Unchecked,Unchecked,,,,,,,,,,,
107,Breast cancer,2/23/2018,4/5/2018,,,Unchecked,Unchecked,Unchecked,Unchecked,Unchecked,,Checked,Unchecked,Unchecked,Unchecked,Unchecked,,Unchecked,Unchecked,Unchecked,Unchecked,Unchecked,,,,,,,,,,,
108,Breast cancer,2/23/2018,4/5/2018,,,Unchecked,Unchecked,Unchecked,Unchecked,Unchecked,,Checked,Unchecked,Unchecked,Unchecked,Unchecked,,Unchecked,Unchecked,Unchecked,Unchecked,Unchecked,,,,,,,,,,,