,chr,pos,strand,Name,AddressA,AddressB,ProbeSeqA,ProbeSeqB,Type,NextBase,Color,Probe_rs,Probe_maf,CpG_rs,CpG_maf,SBE_rs,SBE_maf,Islands_Name,Relation_to_Island,Forward_Sequence,SourceSeq,UCSC_RefGene_Name,UCSC_RefGene_Accession,UCSC_RefGene_Group,Phantom4_Enhancers,Phantom5_Enhancers,DMR,X450k_Enhancer,HMM_Island,Regulatory_Feature_Name,Regulatory_Feature_Group,GencodeBasicV12_NAME,GencodeBasicV12_Accession,GencodeBasicV12_Group,GencodeCompV12_NAME,GencodeCompV12_Accession,GencodeCompV12_Group,DNase_Hypersensitivity_NAME,DNase_Hypersensitivity_Evidence_Count,OpenChromatin_NAME,OpenChromatin_Evidence_Count,TFBS_NAME,TFBS_Evidence_Count,Methyl27_Loci,Methyl450_Loci,Random_Loci,logFC,AveExpr,t,P.Value,adj.P.Val,B,cpg,Adult_avgBeta,Child_avgBeta,deltaBeta
1,chr4,48485301,-,cg19247841,54642915,97721290,AACAAAACCACTTACTAACAATTCACAAAAAAAAACCAAACAACAAAACA,AACAAAACCACTTACTAACGATTCACAAAAAAAAACCGAACGACAAAACG,I,A,Red,NA,NA,NA,NA,NA,NA,chr4:48485362-48486473,N_Shore,GCTACACTCGATAACAGAACCACTTACTGGCGATTCACAGGAGGGGACCGGGCGGCAGGG[CG]GGGCGGGGCCTGCGGGGCGCGGGGCCGCGGCGCGGAGCCGGCGCAGCGATTGGGTTCACC,AACAGAACCACTTACTGGCGATTCACAGGAGGGGACCGGGCGGCAGGGCG,SLC10A4,NM_152679,TSS200,high-CpG:48180033-48180182,,,TRUE,4:48179840-48181568,4:48484734-48486402,Unclassified_Cell_type_specific,SLC10A4,ENST00000273861.4,TSS200,SLC10A4,ENST00000273861.4,TSS200,chr4:48484965-48487475,3,,,,,,TRUE,,-5.345949417,-1.998868389,-33.58035523,5.35E-17,4.33E-11,22.89793925,cg19247841,0.036901146,0.621554711,-0.584653566
2,chr10,15210264,-,cg04895321,58702578,90600301,AACAAAAATAAACAAAACTAACCAAAAACACACAACAAATAACAATAACA,GACGAAAATAAACGAAACTAACCGAAAACGCGCGACAAATAACAATAACG,I,T,Red,NA,NA,NA,NA,NA,NA,chr10:15209824-15210714,Island,GGCCAGGCCGCCGGCGGGGATGGGCGAGGCTGGCCGGGGGCGCGCGGCAAGTGACAGTAG[CG]TCTCCCCGCCCGGGCCCCAGCCTCCCCGCCCACCCCGGGCCTCGCCTCCCCGCGCACTGC,CGCTACTGTCACTTGCCGCGCGCCCCCGGCCAGCCTCGCCCATCCCCGCC,NMT2,NM_004808,Body,,,,,10:15249734-15251280,,,NMT2,ENST00000441445.1,5'UTR,NMT2,ENST00000441445.1,5'UTR,chr10:15209725-15210775,3,,,,,,TRUE,,4.818647049,-4.409289774,24.98086853,7.47E-15,3.03E-09,20.55807928,cg04895321,0.196274626,0.009226493,0.187048132
3,chr12,13153193,-,cg17232014,51805286,3785105,CAACAAAACAACAAAACAACAAAATAACAAAACAACAAAACAACAAAACA,CGACAAAACGACAAAACGACAAAATAACAAAACGACAAAACGACGAAACG,I,A,Red,NA,NA,NA,NA,NA,NA,chr12:13152819-13153084,S_Shore,AGGGCGGCAGGGCGGCAGGGCGGCAGGGCGGCAGGGTGGCAGGGCGGCAAGGCGGCGGGA[CG]GCGAGGCGGCGAGGCGAGAGGCGGGGCTAGAGGCAGGGGCCAGAGGGCGTGGCTAGAGGG,CGGCAGGGCGGCAGGGCGGCAGGGTGGCAGGGCGGCAAGGCGGCGGGACG,HEBP1;HEBP1;HTR7P1,NM_015987;NM_015987;NR_002774,1stExon;5'UTR;TSS200,high-CpG:13044437-13044539,,,,12:13044037-13045055,12:13153060-13153569,Promoter_Associated,HEBP1;HEBP1;HEBP1;HEBP1;HTR7P1;RP11-377D9.3,ENST00000536942.1;ENST00000014930.4;ENST00000536942.1;ENST00000014930.4;ENST00000535469.1;ENST00000543321.1,1stExon;1stExon;5'UTR;5'UTR;TSS200;TSS200,HEBP1;HEBP1;HEBP1;HEBP1;HTR7P1;RP11-377D9.3,ENST00000536942.1;ENST00000014930.4;ENST00000536942.1;ENST00000014930.4;ENST00000535469.1;ENST00000543321.1,1stExon;1stExon;5'UTR;5'UTR;TSS200;TSS200,chr12:13153145-13154535,3,,,,,,,,-3.547699737,-2.109730487,-15.19163258,2.48E-11,5.03E-06,15.13778491,cg17232014,0.062698611,0.455038206,-0.392339596
4,chr10,65186953,-,cg17983571,87667253,,ACRATAACRACAACAACTACTTAAACATAATACAATAATAACTAAACTAC,,II,,,NA,NA,NA,NA,NA,NA,,OpenSea,GACAACTCATGGCGGTGGCGGCAGCAGCTGCTTGGGCATGGTGCAGTGGTGACTGAGCTA[CG]AGCCTGGCGGCGGGTGTTCGCCGAGCTCCGGTCCCCGCGTGTCTCCCAGAAGGCGGTGAA,CGGTGGCGGCAGCAGCTGCTTGGGCATGGTGCAGTGGTGACTGAGCTACG,JMJD1C,NM_032776,Body,,,,,10:64856911-64856999,,,RP11-351O1.2;JMJD1C,ENST00000439942.2;ENST00000399251.1,TSS200;5'UTR,RP11-351O1.2;JMJD1C,ENST00000439942.2;ENST00000399251.1,TSS200;5'UTR,,,,,,,,TRUE,,2.448357681,1.302344088,13.58577556,1.45E-10,2.35E-05,13.73142746,cg17983571,0.816805243,0.571536671,0.245268572
5,chr12,15039432,-,cg13302154,84614486,,AAAATAAAAATATCCRATACACCATAAATTCTATTTCCTTAATCAACACC,,II,,,NA,NA,NA,NA,NA,NA,,OpenSea,AAGGGTTCATCAGGATGGAGATATCCGGTGCACCATGAGTTCTGTTTCCTTAATCAACAC[CG]TTGTAACTTGCCCATCCAGTTTTGTGACATTAATTCAAACCTGTGCCCTAGTCCTCTTTT,CGGTGTTGATTAAGGAAACAGAACTCATGGTGCACCGGATATCTCCATCC,MGP,NM_000900,TSS1500,,,,,,,,MGP;MGP;C12orf60,ENST00000228938.5;ENST00000539261.1;ENST00000527783.1,TSS1500;TSS1500;5'UTR,MGP;MGP;MGP;C12orf60;C12orf60;C12orf60,ENST00000507170.2;ENST00000228938.5;ENST00000539261.1;ENST00000533472.1;ENST00000527783.1;ENST00000543822.1,TSS1500;TSS1500;TSS1500;5'UTR;5'UTR;5'UTR,chr12:15039280-15039535,3,,,,,TRUE,TRUE,,-2.073974604,-0.379713814,-13.22301358,2.21E-10,2.48E-05,13.38429153,cg13302154,0.261271184,0.625797472,-0.364526288
6,chr7,5014415,-,cg23031969,11804855,,CCCRATAAAACRAAACCAAAACTCTAAAACTTAAACCACTTACAACCAAC,,II,,,rs116563339,0.023458,NA,NA,NA,NA,chr7:5013508-5014436,Island,GTGGTTCTGCTCCCGGTGGAACGGGACCAGGGCTCTAAGACTTGGGCCACTTGCAGCCAA[CG]TGGAGCGTGCGCGGCGTGCGGGTTACAGAAATTTCTGACAAATCCGCCAGGGCTCTGTGA,CCGGTGGAACGGGACCAGGGCTCTAAGACTTGGGCCACTTGCAGCCAACG,RNF216L;RNF216L;RNF216L,NR_015449;NR_023384;NR_023385,Body;Body;Body,,,,,7:4980016-4980962,7:5013341-5014593,Promoter_Associated,,,,RNF216P1;RNF216P1;RNF216P1;RNF216P1;RNF216P1;RNF216P1;RNF216P1,ENST00000493407.1;ENST00000429902.1;ENST00000406089.2;ENST00000477090.1;ENST00000404006.1;ENST00000403969.1;ENST00000494947.1,5'UTR;5'UTR;5'UTR;5'UTR;5'UTR;5'UTR;5'UTR,chr7:5013520-5014550,3,,,,,,TRUE,,-1.616466504,-1.916369332,-13.12400268,2.49E-10,2.48E-05,13.28751721,cg23031969,0.144582148,0.295757312,-0.151175164
7,chr2,71358320,-,cg17064663,97780230,,AACTAAACTTCTTCAAAAATAAAACTTCCATATCTCTTCCCAACACAAAC,,II,,,NA,NA,NA,NA,NA,NA,chr2:71357187-71357952,S_Shore,CCACCCCCCATGACTAAGCTTCTTCAGAAATAGAACTTCCATGTCTCTTCCCAACACAAG[CG]TTTTATATGTATTTTGTTGAAGAATTTAAAATGTGATCTATGAAATTATTACTCATTTAT,CGCTTGTGTTGGGAAGAGACATGGAAGTTCTATTTCTGAAGAAGCTTAGT,MCEE;MPHOSPH10,NM_032601;NM_005791,TSS1500;Body,,,,,,2:71356823-71358338,Promoter_Associated,MCEE;MPHOSPH10,ENST00000244217.5;ENST00000468427.1,TSS1500;5'UTR,MCEE;MCEE;MCEE;MPHOSPH10;MPHOSPH10,ENST00000494660.2;ENST00000244217.5;ENST00000486135.1;ENST00000498451.1;ENST00000468427.1,TSS1500;TSS1500;TSS1500;5'UTR;5'UTR,,,,,chr2:71352363-71359810,6,,,,-1.76709425,-1.704239108,-13.08878108,2.59E-10,2.48E-05,13.25287771,cg17064663,0.163316543,0.32900946,-0.165692917
8,chr1,29487000,-,cg01993027,53642151,,ACCACAAAAATCTTTACCATTCAATTCATAAACAACATCATCTACATCAC,,II,,,NA,NA,NA,NA,NA,NA,,OpenSea,ATTACTCGCTCACCACAAAGGTCTTTGCCATTCAGTTCATAAACAGCATCATCTGCATCA[CG]CAGATCATCAAACTCCACAAAACCATATCTAGAAGAGAGCAAAGAAAATACTGGTTGGTA,CCACAAAGGTCTTTGCCATTCAGTTCATAAACAGCATCATCTGCATCACG,SRSF4,NM_005626,Body,,,,,,,,SRSF4,ENST00000466448.1,3'UTR,SRSF4;SRSF4;SRSF4;SRSF4;SRSF4;SRSF4,ENST00000497015.1;ENST00000477193.1;ENST00000497015.1;ENST00000489898.1;ENST00000466448.1;ENST00000472353.1,3'UTR;TSS1500;1stExon;TSS200;3'UTR;3'UTR,,,,,,,,,,2.366447614,1.665044635,12.97657356,2.97E-10,2.48E-05,13.1417708,cg01993027,0.843898168,0.640892654,0.203005514
9,chr6,37012640,-,cg09048334,63719182,58786925,TTTTAAAATAATACTTTACAACACTACAACAATCCAAATCAAAAATAACA,TTTTAAAATAATACTTTACGACGCTACGACAATCCAAATCAAAAATAACG,I,A,Red,NA,NA,NA,NA,NA,NA,chr6:37012609-37012884,Island,TAAAGTTGAACATTTTAAAATAATGCTTTGCGGCGCTGCGGCAGTCCAGATCAAAAATGG[CG]GCAGTTGGTGTGTTCTCGGTTTCTCGGCTGCTGGGTCGGTCCCGCCCACAGCTGGGGCGG,TTTTAAAATAATGCTTTGCGGCGCTGCGGCAGTCCAGATCAAAAATGGCG,,,,,,,,6:37120618-37120862,,,COX6A1P2,ENST00000423336.1,1stExon,COX6A1P2,ENST00000423336.1,1stExon,chr6:37012525-37012715,3,,,,,,TRUE,,2.589191077,-1.804032085,12.93772871,3.11E-10,2.48E-05,13.1030378,cg09048334,0.347407577,0.143784678,0.203622899
10,chr16,1370586,+,cg01346915,76634598,51735174,AAACATAAACCCTAACTATCCATAAAATAAACCTATATCCTCCACTCCCA,AAACGTAAACCCTAACTATCCGTAAAATAAACCTATATCCTCCACTCCCG,I,T,Red,rs8043720,0.066618,NA,NA,NA,NA,chr16:1369053-1369525,S_Shore,GCAGCCCTGGCCCCGCTGGTGGCAGCTCCTCCCCGTCCCAGCCAAGGCCGCCTGGCAGGA[CG]GGAGTGGAGGACACAGGCTCACCCTACGGACAGCCAGGGTCCACGCCTCTGTGGGGAAGG,CGGGAGTGGAGGACACAGGCTCACCCTACGGACAGCCAGGGTCCACGCCT,UBE2I;UBE2I;UBE2I;UBE2I,NM_194261;NM_003345;NM_194260;NM_194259,Body;Body;Body;Body,,,,,16:1310510-1310699,,,LA16c-358B7.3;LA16c-358B7.3,ENST00000567829.1;ENST00000568106.1,3'UTR;3'UTR,LA16c-358B7.3;LA16c-358B7.3;UBE2I;UBE2I,ENST00000567829.1;ENST00000568106.1;ENST00000568989.1;ENST00000568288.1,3'UTR;3'UTR;5'UTR;5'UTR,chr16:1370225-1370595,3,,,,,,TRUE,,-2.277530742,2.486948297,-12.87098443,3.37E-10,2.48E-05,13.03615984,cg01346915,0.750529028,0.909158933,-0.158629905
11,chr22,41185283,-,cg26548134,85721230,,TATAACAAATACTTCRTAATACAATCTACTCRAAACATAAACTACAACCC,,II,,,NA,NA,NA,NA,NA,NA,chr22:41185197-41185416,Island,CCCGGCAGGAGTATGACAGATGCTTCGTAATGCAGTCTGCTCGAGGCATGGGCTGCAGCC[CG]GTCCCTGCGTCCTACAGAGACACCGTCCACGCGGTGCCCGGACCCCGGACCAGCCACGGG,CGGGCTGCAGCCCATGCCTCGAGCAGACTGCATTACGAAGCATCTGTCAT,SLC25A17,NM_006358,Body,,,,,22:39515210-39515362,,,SLC25A17,ENST00000491545.1,3'UTR,SLC25A17;SLC25A17;SLC25A17;SLC25A17;SLC25A17;SLC25A17;SLC25A17;SLC25A17;SLC25A17,ENST00000427084.1;ENST00000412879.1;ENST00000491545.1;ENST00000447566.1;ENST00000430221.1;ENST00000458600.1;ENST00000443810.1;ENST00000434193.1;ENST00000449676.1,3'UTR;3'UTR;3'UTR;3'UTR;3'UTR;3'UTR;3'UTR;3'UTR;3'UTR,,,,,,,,TRUE,,1.759829835,1.560050454,12.60222008,4.67E-10,2.82E-05,12.76263107,cg26548134,0.821322562,0.650339659,0.170982903
12,chr17,7833163,+,cg27162435,97746305,,RACTCTATACAAATAAAAAAACRATACCTACATACTAATAAACTAAACCC,,II,,,NA,NA,NA,NA,NA,NA,chr17:7832532-7833164,Island,GAGATGCCACTTCAGCGCGAACCGCTGCGGGACCCGCTGGGCTCCCAGCCGCGTCGGCAG[CG]GGCCCAGCTCATCAGCATGCAGGCACCGCCTCCTCATCTGCATAGAGCCGCCCTCCTCTC,CGGGCCCAGCTCATCAGCATGCAGGCACCGCCTCCTCATCTGCATAGAGC,KCNAB3,NM_004732,TSS1500,,,,,17:7773262-7773982,17:7833067-7833374,Unclassified_Cell_type_specific,KCNAB3;RP11-1099M24.7,ENST00000303790.2;ENST00000573621.1,TSS1500;3'UTR,KCNAB3;KCNAB3;RP11-1099M24.7,ENST00000303790.2;ENST00000570852.1;ENST00000573621.1,TSS1500;TSS200;3'UTR,chr17:7833065-7833310,3,,,,,,TRUE,,3.027370475,1.541014949,12.56742815,4.87E-10,2.82E-05,12.72672075,cg27162435,0.881277864,0.523986322,0.357291542
13,chr15,52797240,+,cg03889742,18790574,,AATAAATTAATAAAATAAACCTATCTTAAATTCCTACCTCCACAACTCCC,,II,,,NA,NA,NA,NA,NA,NA,,OpenSea,GCTATTCTGGCAGCTCAATAATGTCGTTAAGAACTCAGACTCGGCAGTTCCCATTATCTT[CG]GGAGCTGTGGAGGTAGGAATTTAAGACAGGCCCATTTTATTAATTTATTTTCAAATGCAA,CGGGAGCTGTGGAGGTAGGAATTTAAGACAGGCCCATTTTATTAATTTAT,MYO5A;MYO5A,NM_000259;NM_001142495,Body;Body,,,,,,,,EEF1B2P1;MYO5A,ENST00000443885.1;ENST00000546028.1,TSS200;5'UTR,EEF1B2P1;MYO5A,ENST00000443885.1;ENST00000546028.1,TSS200;5'UTR,,,,,,,,,,2.067314556,0.890176949,12.10025441,8.73E-10,4.42E-05,12.23307695,cg03889742,0.766253569,0.510126941,0.256126628
14,chr3,16642858,-,cg07113537,37624139,,TCTAACTTTAACTTAAATCTTACAAACTAACTACCTACTTAACTAAAATC,,II,,,rs57742889,0.02333,NA,NA,NA,NA,chr3:16645948-16646259,N_Shelf,TTATTAGGAAGTCTGACTTTGGCTTGGATCTTACAAACTGGCTGCCTGCTTAACTGGAAT[CG]TAAATATAAAATTCATAGGATCACTTTAATAGCGTAATAACATCTTAAATTAAGGAGGCA,CGATTCCAGTTAAGCAGGCAGCCAGTTTGTAAGATCCAAGCCAAAGTCAG,DAZL;DAZL,NM_001190811;NM_001351,Body;Body,,,,TRUE,,3:16642715-16643183,Unclassified_Cell_type_specific,,,,,,,chr3:16642840-16643055,3,,,,,,,,-1.990299568,-0.809855359,-11.95832129,1.05E-09,4.80E-05,12.07878066,cg07113537,0.230336584,0.547369115,-0.317032531
15,chr7,33935438,+,cg26947034,85726252,,ACCCAAACTCTAAACAATTATATATTAAATTCTTTAACCTCCCTTATAAC,,II,,,NA,NA,NA,NA,NA,NA,,OpenSea,GGTTTGGCATACGTTATTGCATTTAGTCCACAAAATAGATATCATCAATATTGTCATCCA[CG]CTACAAGGGAGGTTAAAGAATCCAATACACAATTGTTTAGAGCCTGGGCCACTCCAATTC,CGCTACAAGGGAGGTTAAAGAATCCAATACACAATTGTTTAGAGCCTGGG,,,,,,,,,7:33934297-33935716,Unclassified,,,,,,,,,,,chr7:33934440-33935886,6,,,,-1.834889846,0.019310837,-11.94272971,1.07E-09,4.80E-05,12.06170544,cg26947034,0.353037748,0.653742087,-0.300704339
16,chr5,68411141,-,cg19471613,71668167,,TATATTATAAAATTAATTTTCATACAACTTCCAAAAAACTCTCTATCRAC,,II,,,NA,NA,NA,NA,NA,NA,,OpenSea,AGTACTGGCTTTGTGTTGTAAAGTTGGTTTTCATACAGCTTCCAGAAAGCTCTCTGTCGA[CG]TTGGTGGAGCTAAACGTCTTCAAGCTTTATCTCATCTTGTTTCTGTGCTTCTCTTGTGCC,CGTCGACAGAGAGCTTTCTGGAAGCTGTATGAAAACCAACTTTACAACAC,SLC30A5,NM_022902,Body,,,,,,,,SLC30A5;CTC-498J12.3,ENST00000438236.2;ENST00000504129.1,TSS1500;3'UTR,SLC30A5;SLC30A5;CTC-498J12.3,ENST00000438236.2;ENST00000507354.1;ENST00000504129.1,TSS1500;5'UTR;3'UTR,,,,,,,,,,2.013652706,0.533992329,11.86539704,1.18E-09,4.82E-05,11.97664359,cg19471613,0.716858757,0.451498522,0.265360234
17,chr15,62535557,+,cg07625092,4796112,,TAATCAAAAAAACCCCAATATCTAAACCCTATCCTCCTACAAAAAAATAC,,II,,,NA,NA,NA,NA,NA,NA,,OpenSea,ATGTACTCATTCTCCCGGTCCACGTCTTCAGCACTGACCTCTGGCTCTGGTATGATGTGA[CG]TACTTTCCTGCAGGAGGACAGGGCTCAGACATTGGGGCCCCTCTGACCACCCTGCAGCTC,GGTCAGAGGGGCCCCAATGTCTGAGCCCTGTCCTCCTGCAGGAAAGTACG,,,,,,,,,,,RP11-299H22.3;RP11-299H22.3,ENST00000563606.1;ENST00000561706.1,TSS200;TSS1500,RP11-299H22.3;RP11-299H22.3,ENST00000563606.1;ENST00000561706.1,TSS200;TSS1500,chr15:62534805-62535895,3,,,,,,,,1.450864829,0.452121741,11.8021235,1.28E-09,4.82E-05,11.90658487,cg07625092,0.662348162,0.488029272,0.17431889
18,chr11,59394462,-,cg08876558,74675189,,TATATCATTTTAATATCRATTCCRCATACAAAACAATCRAATTACCCTAC,,II,,,NA,NA,NA,NA,NA,NA,,OpenSea,ATATGTGTGCATGTATCATTTTGATGTCGATTCCGCATGCAGAGCAGTCGAGTTGCCCTA[CG]TGTGCCACTCACGACAGAAGCCCTTTTTTGCATGTATCATTTTGGTAGAATGATTTATAT,GTATCATTTTGATGTCGATTCCGCATGCAGAGCAGTCGAGTTGCCCTACG,,,,,,,,,,,AP000442.1;AP000442.1,ENST00000531108.1;ENST00000531311.1,5'UTR;5'UTR,AP000442.1;AP000442.1,ENST00000531108.1;ENST00000531311.1,5'UTR;5'UTR,,,,,chr11:59394433-59395049,6,,,,2.478678432,1.058180294,11.78617476,1.31E-09,4.82E-05,11.88886,cg08876558,0.800780093,0.51547918,0.285300913
19,chr4,104020949,+,cg02214188,14717909,,TTATCTCAAATTTATTACTCAAACCRAATTCTAAAAAACRCCATCAACTC,,II,,,NA,NA,NA,NA,NA,NA,,OpenSea,TCCCCTCTTTCCGTTCTAAAGTTTCATTTCAAAAGTATTAGGAAATCTTACTTTAAGCAG[CG]AGCTGATGGCGTTCTCCAGAACTCGGTTTGAGCAACAAACTTGAGACAACCTTTGTCTGG,TGTCTCAAGTTTGTTGCTCAAACCGAGTTCTGGAGAACGCCATCAGCTCG,BDH2;BDH2,NM_020139;NM_020139,1stExon;5'UTR,,,,,,4:104020653-104021340,Promoter_Associated,BDH2;BDH2,ENST00000296424.4;ENST00000296424.4,5'UTR;1stExon,BDH2;BDH2;BDH2;BDH2;BDH2;BDH2;BDH2;BDH2;BDH2;BDH2;BDH2;BDH2;BDH2;BDH2,ENST00000513518.1;ENST00000511354.1;ENST00000506521.1;ENST00000296424.4;ENST00000464039.1;ENST00000475058.1;ENST00000492366.1;ENST00000511354.1;ENST00000513518.1;ENST00000506521.1;ENST00000296424.4;ENST00000492366.1;ENST00000464039.1;ENST00000475058.1,3'UTR;5'UTR;5'UTR;5'UTR;1stExon;1stExon;1stExon;1stExon;1stExon;1stExon;1stExon;3'UTR;3'UTR;3'UTR,chr4:104020920-104021195,3,,,,,TRUE,TRUE,,-2.088215234,-2.024955395,-11.6945885,1.47E-09,4.82E-05,11.78655769,cg02214188,0.12529313,0.302578503,-0.177285372
20,chr2,9770529,+,cg02466933,94770551,,AAAAAAAACTAAACTAATCCAAAAAACCAAACTAACCRAACAAACCRAAC,,II,,,NA,NA,NA,NA,NA,NA,chr2:9770189-9771562,Island,TTGGACAGCTCGGCGCCCTGCTCGGTCACTGCCTTCATGCAGGTGGCCATGTCGTCGTAG[CG]CTCGGCCTGCTCGGCCAGCTTGGCCTTCTGGATCAGCTCAGTCTTCTCCATGGCGGGCGC,CGCTCGGCCTGCTCGGCCAGCTTGGCCTTCTGGATCAGCTCAGTCTTCTC,YWHAQ,NM_006826,Body,high-CpG:9687956-9688692,,,,2:9687456-9689045,2:9770527-9771650,Promoter_Associated,YWHAQ,ENST00000381844.4,1stExon,YWHAQ;YWHAQ,ENST00000381844.4;ENST00000460093.1,1stExon;TSS200,chr2:9770525-9771055,3,,,,,,TRUE,,-1.58989951,-1.807660533,-11.62763719,1.60E-09,4.82E-05,11.71121258,cg02466933,0.15702075,0.307686228,-0.150665478
21,chr12,10103711,+,cg01304461,49647829,,AAAAAAACCAAAATCTATTACTAAAATACCAAAAATTCAACCTAAATCCC,,II,,,NA,NA,NA,NA,NA,NA,,OpenSea,ATAAAGTCATCTCCCCTGGAAATACTTGCCTCAGTGATTGGCATTCTGTGCAATGAGTAA[CG]GGACCTAGGCTGAACCTCTGGCATTTCAGTAACAGATTTTGGTTCCCTCATCAGGAAGAC,CGGGACCTAGGCTGAACCTCTGGCATTTCAGTAACAGATTTTGGTTCCCT,CLEC12A,NM_001207010,TSS1500,,,,,,12:10103534-10104181,Unclassified_Cell_type_specific,AC091814.3;CLEC12A,ENST00000420905.1;ENST00000355690.4,3'UTR;TSS1500,AC091814.3;CLEC12A,ENST00000420905.1;ENST00000355690.4,3'UTR;TSS1500,chr12:10103680-10103950,3,,,,,,,,-1.76756977,-1.314328464,-11.61272052,1.64E-09,4.82E-05,11.69436094,cg01304461,0.202189316,0.393123702,-0.190934385
22,chr2,114481691,+,cg25317548,19726294,,ATAATAAAAACCACAAATACTTATTTCCTTTACCTCATCAATAAAAACTC,,II,,,NA,NA,NA,NA,NA,NA,,OpenSea,AATAAAAGGGGCTATCTCTCAATAAAGTGTCACTAGAAGTAATGAACAGAGGCTGAACAA[CG]AGTCCTTATTGATGAGGTAAAGGAAACAAGTACTTGTGGTTCCCACTACTTAGCTGCTCT,CGAGTCCTTATTGATGAGGTAAAGGAAACAAGTACTTGTGGTTCCCACTA,SLC35F5;SLC35F5,NR_104470;NM_025181,Body;Body,,,,,,,,SLC35F5,ENST00000470204.2,3'UTR,SLC35F5;SLC35F5;SLC35F5;SLC35F5,ENST00000459683.1;ENST00000470204.2;ENST00000485214.1;ENST00000469702.1,3'UTR;3'UTR;3'UTR;TSS1500,chr2:114481680-114481870,3,,,,,,,,-2.116845209,0.741190824,-11.56495331,1.74E-09,4.82E-05,11.64023769,cg25317548,0.469854305,0.756865373,-0.287011068
23,chr14,55583319,-,cg23743591,14790538,,TTATCACCAATTAACTAACAAAAACACAAAAAACAACATTCAACTCTATC,,II,,,NA,NA,NA,NA,NA,NA,,OpenSea,AAGAAAAAACCTTATCACCAGTTGACTGGCAAGGACACAGGAGGCAACATTCAACTCTGT[CG]CCGGGATCTGGGTGGTTGGGTCAAACTTTTGTGGCATTTCTAACTAGTCCCAGTCCCCCA,TATCACCAGTTGACTGGCAAGGACACAGGAGGCAACATTCAACTCTGTCG,,,,,chr14:55583130-55583130,,,,,,,,,,,,chr14:55583040-55583335,3,,,,,,,,-2.765705163,1.194764633,-11.55190174,1.77E-09,4.82E-05,11.62540697,cg23743591,0.492496492,0.841180537,-0.348684045
24,chr11,85568704,+,cg20963267,90685361,,ATCACRTCTATAACCCACTTAATACTATCTATAAAAAACTCCTAACAACC,,II,,,NA,NA,NA,NA,NA,NA,chr11:85565908-85566451,S_Shelf,GAAAGTGCCTGCCATCAATGTCAACAACTCCGTCACCAAGAGCAAGTTTGACAACCTCTC[CG]GCTGCCAGGAGTCCCTCATAGATAGCATCAAGTGGGCCACAGACGTGATGATTGCCAGCA,CGGCTGCCAGGAGTCCCTCATAGATAGCATCAAGTGGGCCACAGACGTGA,CCDC83,NM_173556,5'UTR,,,,,,,,CCDC83;CCDC83;CCDC83,ENST00000280245.4;ENST00000376067.1;ENST00000342404.3,5'UTR;5'UTR;5'UTR,CCDC83;CCDC83;CCDC83,ENST00000280245.4;ENST00000376067.1;ENST00000342404.3,5'UTR;5'UTR;5'UTR,,,,,,,,TRUE,,1.453617419,1.289994072,11.35679174,2.29E-09,5.36E-05,11.40150789,cg20963267,0.782744047,0.62219005,0.160553997
25,chr1,59097190,+,cg00305263,79729568,,AATATACRAACTAATAACAATAAAAAACTTCRACRAACATAACTCCCAAC,,II,,,rs12077107,0.086144,NA,NA,NA,NA,,OpenSea,ACCGGCCCTGGGAGGCCCCAGCAGCACAGCCTTTAGGACACTCGGGTTCTGCCGCTGGCA[CG]CTGGGAGCCATGTCCGCCGAAGTCTCTCACTGCCACCAGTTCGCACACCTCACAGGTCCC,CGCTGGGAGCCATGTCCGCCGAAGTCTCTCACTGCCACCAGTTCGCACAC,,,,,,,,,,,,,,,,,chr1:59097085-59097335,3,,,,,,,,1.845605605,1.672222631,11.30926697,2.45E-09,5.36E-05,11.34634254,cg00305263,0.836381872,0.660723381,0.175658491
26,chr17,7833237,+,cg14918082,76650270,,AAATATTCAAACTACAAAACCTTCAACAAACRAAACTTATACAAATAAAC,,II,,,rs11656822,0.470428,NA,NA,NA,NA,chr17:7835171-7835569,N_Shore,CAGCATGCAGGCACCGCCTCCTCATCTGCATAGAGCCGCCCTCCTCTCAGCCAAACCTGC[CG]CTCATCTGCATAAGCCCCGCCTGCTGAAGGCTCTGCAGCTTGAATATTTTCTGAGCGGAA,AATATTCAAGCTGCAGAGCCTTCAGCAGGCGGGGCTTATGCAGATGAGCG,KCNAB3,NM_004732,TSS1500,,,,,17:7773262-7773982,17:7833067-7833374,Unclassified_Cell_type_specific,KCNAB3;RP11-1099M24.7,ENST00000303790.2;ENST00000573621.1,TSS1500;3'UTR,KCNAB3;KCNAB3;RP11-1099M24.7,ENST00000303790.2;ENST00000570852.1;ENST00000573621.1,TSS1500;TSS200;3'UTR,chr17:7833065-7833310,3,,,,,TRUE,TRUE,,3.100201678,1.424882588,11.2744305,2.56E-09,5.36E-05,11.30574757,cg14918082,0.86794758,0.507121469,0.360826111
27,chr19,54805375,+,cg21898358,91615267,,TCTAACCTCTATTATTTAATATAAATCCATCTACACTTAAAAACTTCCAC,,II,,,NA,NA,NA,NA,NA,NA,,OpenSea,AATGTACGTGAAGTATTTCTGAAATATGCAGAACATCAATATCATGAGCAGAAAAAGAGG[CG]TGGAAGTCTCCAAGTGTAGATGGATCCACATTAAATAACAGAGGCCAGAGGTGAGTCGCC,CTGGCCTCTGTTATTTAATGTGGATCCATCTACACTTGGAGACTTCCACG,LILRA3;LILRA3,NM_001172654;NM_006865,TSS1500;TSS1500,,,,,,,,LILRA3;LILRA3;LILRA3,ENST00000391745.1;ENST00000391744.3;ENST00000251390.3,5'UTR;TSS1500;TSS1500,LILRA3;LILRA3;LILRA3,ENST00000391745.1;ENST00000391744.3;ENST00000251390.3,5'UTR;TSS1500;TSS1500,,,,,,,,,,1.855416324,1.845201372,11.26728371,2.59E-09,5.36E-05,11.29740286,cg21898358,0.852877704,0.685218225,0.167659478
28,chr2,101044200,-,cg12291982,4795476,,AAATACTCTAATACTCTAAAACTTCTAAAAAACCRAACTCTAAAAACAAC,,II,,,NA,NA,NA,NA,NA,NA,,OpenSea,TCTGCTGAAATGGATGCTCTGATGCTCTGAAGCTTCTGGGAGGCCGGGCTCTGGAGGCAA[CG]TGCTGCAGGCGCACTCTGTCAGAGTGAACAGCACCCGCGAGACAGGCCAGGCTCCTGGCT,GATGCTCTGATGCTCTGAAGCTTCTGGGAGGCCGGGCTCTGGAGGCAACG,,,,,,,,,2:101044068-101044534,Unclassified_Cell_type_specific,,,,,,,chr2:101044105-101044395,3,,,,,,,,-1.728658406,-1.480349446,-11.2492976,2.65E-09,5.36E-05,11.27637695,cg12291982,0.192349971,0.355336375,-0.162986404
29,chr1,94978879,-,cg23646894,82684439,,CTACAATTAATTCAATAACATAACAACTCTTTACTAATAATTTTAACCAC,,II,,,NA,NA,NA,NA,NA,NA,,OpenSea,AACCATGTAGTCTGCAGTTGATTCAATGACATAGCAGCTCTTTGCTGGTAATTTTGACCA[CG]TGATTTCCTCTTATGCTCTAGCTATAGGCTTGAAGTCCCCACATAAGACTGTATAAATTC,CGTGGTCAAAATTACCAGCAAAGAGCTGCTATGTCATTGAATCAACTGCA,ABCD3,NM_002858,Body,,,,,,,,ABCD3,ENST00000484213.1,5'UTR,ABCD3;ABCD3,ENST00000464165.1;ENST00000484213.1,TSS200;5'UTR,,,,,,,,,,1.847772233,0.063345677,11.23680208,2.69E-09,5.36E-05,11.2617485,cg23646894,0.654019793,0.366705339,0.287314454
30,chr10,81899292,+,cg14152806,42696212,,AAAAAAACTATACAAAATAAACCRACATCAACAAAAAATCCTAAAAACAC,,II,,,NA,NA,NA,NA,NA,NA,,OpenSea,TCCAGCCATCTGTCTTTGCTGCCCTGCACCCAGACTGTGGAGCACTGCTGGGGGAGGACT[CG]TGCTTCCAGGATTCCTTGTTGATGCCGGCTCATTCTGCATAGCCCTCCTACACTGCATCC,CGTGCTTCCAGGATTCCTTGTTGATGCCGGCTCATTCTGCATAGCCCTCC,PLAC9,NM_001012973,Body,,,,,,,,PLAC9,ENST00000372270.1,5'UTR,PLAC9,ENST00000372270.1,5'UTR,chr10:81899045-81899335,3,,,,,,,,1.934756722,1.367860564,11.23109761,2.72E-09,5.36E-05,11.25506455,cg14152806,0.80511844,0.611872807,0.193245633
31,chr14,62331287,-,cg04791162,40750954,,ATTATAATATAATAAAAATAAACAACCTAACCTACCAAATACTACATAAC,,II,,,NA,NA,NA,NA,NA,NA,chr14:62331009-62331641,Island,TGGCCTTGTGGATTATGATGTGGTAGAGATGAGCAACCTGGCCTACCAAGTGCTGCATGG[CG]AGGCACTGGCTGCACAGGCCAAGGCCGCTTCGGCCGCCGCCTCGCTGCGCGGCCTCAATT,CGCCATGCAGCACTTGGTAGGCCAGGTTGCTCATCTCTACCACATCATAA,,,,,,,,14:61400775-61401394,,,CTD-2277K2.1;CTD-2277K2.1,ENST00000554436.1;ENST00000554138.1,TSS1500;5'UTR,CTD-2277K2.1;CTD-2277K2.1,ENST00000554436.1;ENST00000554138.1,TSS1500;5'UTR,chr14:62331080-62331350,3,,,,,,TRUE,,1.95928489,1.342065365,11.21096481,2.79E-09,5.38E-05,11.23144597,cg04791162,0.805853536,0.60272477,0.203128765
32,chr17,26443366,-,cg11792281,79771578,,CACCTATTAAAACCATATTTCAAAATCAAACCATACTAATTTAAACAAAC,,II,,,NA,NA,NA,NA,NA,NA,,OpenSea,AACACTGGCAGCACCTATTGAGGCCATGTTTCAGGATCAGACCATGCTGGTTTGAGCAGA[CG]CAGCAAGAGTGAGAACCCCGGCCGAATTTTCATGGGTGGCTCTAGTAGAGCTGCTGGTGA,ACCTATTGAGGCCATGTTTCAGGATCAGACCATGCTGGTTTGAGCAGACG,NLK,NM_016231,Body,,,,TRUE,,,,,,,,,,,,,,,,,TRUE,,3.198669058,0.597187761,11.18690043,2.88E-09,5.43E-05,11.20315594,cg11792281,0.768025288,0.41174506,0.356280228
33,chr17,4608515,+,cg13593809,57649136,,AAAACRAAAACTTAAATACCTTCAAAATTCAACTTCACTTATAACCCACC,,II,,,NA,NA,NA,NA,NA,NA,chr17:4606984-4607722,S_Shore,CTTGTGAAGCAGTATTAACATCCATTACCCCTCCAGCAGCAATGCCTTCCTCGGCCGTGG[CG]GTGGGTTACAAGTGAAGCTGAATCTTGAAGGTACCCAAGCCTCCGCCTCCGCGCAACTCG,AGGCGGAGGCTTGGGTACCTTCAAGATTCAGCTTCACTTGTAACCCACCG,LOC101559451;PELP1;PELP1,NR_103482;NM_001278241;NM_014389,Body;TSS1500;TSS1500,,,,,17:4555128-4555325,,,RP11-314A20.2;PELP1;PELP1;PELP1;PELP1,ENST00000497885.1;ENST00000436683.2;ENST00000574876.1;ENST00000572293.1;ENST00000269230.7,5'UTR;TSS1500;TSS1500;TSS1500;TSS1500,RP11-314A20.2;PELP1;PELP1;PELP1;PELP1;PELP1;PELP1;PELP1;PELP1,ENST00000497885.1;ENST00000570571.1;ENST00000575342.1;ENST00000575101.1;ENST00000573523.1;ENST00000436683.2;ENST00000574876.1;ENST00000572293.1;ENST00000269230.7,5'UTR;TSS1500;TSS1500;TSS1500;TSS1500;TSS1500;TSS1500;TSS1500;TSS1500,chr17:4608440-4608735,3,,,,,,,,2.422464799,1.504674626,11.12992944,3.11E-09,5.73E-05,11.13592329,cg13593809,0.834996167,0.604351125,0.230645042
34,chr1,109046245,+,cg12615557,40733820,,ATAATTCCTAATAAAAAACATTATCTACATAAATACCCTAATAACAAACC,,II,,,NA,NA,NA,NA,NA,NA,,OpenSea,GGGGTGCTTTGAAGATAATCTCTACCTGTCTACCCTGAATGCAACTAAAGCATTTTACAG[CG]GTTTGCCATTAGGGTATTCATGCAGATAATGCTTTCTACTAGGAATTACAAACTTTAAAC,TAATTCCTAGTAGAAAGCATTATCTGCATGAATACCCTAATGGCAAACCG,,,,,,,,,,,,,,,,,chr1:109045720-109046270,3,,,,,,,,2.293144616,0.062439243,11.00868979,3.67E-09,6.37E-05,10.99163125,cg12615557,0.636482857,0.389176387,0.24730647