dataset,age_yrs,loweduc,orig_def,sev_uncomp,distance_km,travhrs,pf_3cat,urban_tanzania,pop_dens_over300,duration_illness_days,duration_fever_days,cm,sma,rds,hyperlact,hypogly,hyperpar,renal_imp,jaund,prostration,death,hb,transfusion,temperature,duration_convulsions_days,duration_unconscious_days,duration_diffbreath_days,duration_fastbreath_days,duration_respdist_days,duration_coma_days,prior_antimal,prior_act
Gambia 2005_2011,12,,0,Uncomplicated,,,1,,1,3,,0,0,,0,0,0,,,0,Alive,11.89999962,0,36,,,,,,,0,0
Gambia 2005_2011,14,,0,Uncomplicated,,,1,,1,7,,0,0,,0,0,0,,,0,Alive,12.60000038,0,36.29999924,,,,,,,0,0
Gambia 2005_2011,5,,0,Uncomplicated,,,1,,1,3.3,,0,0,,0,0,0,,,0,Alive,10.60000038,0,36.59999847,,,,,,,0,0
Gambia 2005_2011,8,,0,Uncomplicated,,,1,,1,2.5,,0,0,,0,0,0,,,0,Alive,13,0,37.40000153,,,,,,,0,0
Gambia 2005_2011,12,,0,Uncomplicated,,,1,,1,7,,0,0,,0,0,0,,,0,Alive,12.19999981,0,36.29999924,,,,,,,1,
Gambia 2005_2011,10,,0,Uncomplicated,,,1,,1,2,,0,0,,0,0,0,0,0,0,Alive,11.80000019,0,36.59999847,,,,,,,0,0
Gambia 2005_2011,12,,0,Uncomplicated,,,1,,1,3,,0,0,,0,0,0,,,0,,11,,37,,,,,,,0,0
Gambia 2005_2011,13,,0,Uncomplicated,,,1,,1,7,,0,0,,0,0,0,,,0,Alive,12,0,36.59999847,,,,,,,0,0
Gambia 2005_2011,3,,0,Uncomplicated,,,1,,1,7,,0,0,,0,0,0,,,0,Alive,8.199999809,0,37.40000153,,,,,,,1,
Gambia 2005_2011,7,,0,Uncomplicated,,,1,,1,3,,0,0,,0,0,0,,,0,Alive,11.19999981,0,36.40000153,,,,,,,1,
Gambia 2005_2011,13,,0,Uncomplicated,,,1,,1,4,,0,0,,0,0,0,,,0,Alive,11.5,0,36.70000076,,,,,,,0,0
Gambia 2005_2011,4,,0,Uncomplicated,,,1,,1,14,,0,0,,0,0,0,,,0,Alive,9.399999619,0,38.20000076,,,,,,,1,1
Gambia 2005_2011,14,,0,Uncomplicated,,,1,,1,0,,0,0,,0,0,0,,,0,Alive,12.30000019,0,37,,,,,,,0,0
Gambia 2005_2011,12,,0,Uncomplicated,,,1,,1,5,,0,0,,0,0,0,,,0,,10.89999962,,37.09999847,,,,,,,,
Gambia 2005_2011,11,,0,Uncomplicated,,,1,,1,4,,0,0,,0,0,0,,,0,Alive,16.89999962,0,36.40000153,,,,,,,0,0
Gambia 2005_2011,7,,0,Uncomplicated,,,1,,1,4.8000002,,0,0,,0,0,0,,,0,Alive,9,0,38.40000153,,,,,,,1,
Gambia 2005_2011,3,,0,Uncomplicated,,,1,,1,9.8000002,,0,0,,0,0,0,,,0,Alive,9.300000191,0,37.70000076,,,,,,,0,0
Gambia 2005_2011,3,,0,Uncomplicated,,,1,,1,7,,0,0,,0,0,0,,,0,Alive,17.5,0,38.79999924,,,,,,,1,
Gambia 2005_2011,6,,0,Uncomplicated,,,1,,1,5,,0,0,,0,0,0,,,0,Alive,16.20000076,0,37.59999847,,,,,,,0,0
Gambia 2005_2011,15,,0,Uncomplicated,,,1,,1,1,,0,0,,0,0,,,,0,Alive,11.30000019,0,39.20000076,,,,,,,0,0
Gambia 2005_2011,8,,0,Uncomplicated,,,1,,1,3,,0,0,,0,0,0,,,0,,13.89999962,0,37.40000153,,,,,,,0,0
Gambia 2005_2011,13,,0,Uncomplicated,,,1,,1,3,,0,0,,0,0,0,,,0,Alive,12.80000019,0,36.5,,,,,,,0,0
Gambia 2005_2011,7,,0,Uncomplicated,,,1,,1,3,,0,0,,0,0,0,,,0,,12.60000038,0,36.40000153,,,,,,,0,0
Gambia 2005_2011,11,,0,Uncomplicated,,,1,,1,2,,0,0,,0,0,0,,,0,Alive,13.39999962,0,36.40000153,,,,,,,0,0
Gambia 2005_2011,13,,0,Uncomplicated,,,1,,1,6.5,,0,0,,0,0,0,,,0,Alive,14.69999981,0,37.20000076,,,,,,,1,
Gambia 2005_2011,10,,0,Uncomplicated,,,1,,1,2,,0,0,,0,0,0,,,0,Alive,12.5,0,38,,,,,,,0,0
Gambia 2005_2011,10,,0,Uncomplicated,,,1,,1,3,,0,0,,0,0,0,,,0,Alive,13.30000019,0,38.90000153,,,,,,,1,
Gambia 2005_2011,10,,0,Uncomplicated,,,1,,1,2.5,,0,0,,0,0,0,,,0,Alive,13.60000038,0,39.70000076,,,,,,,0,0
Gambia 2005_2011,7,,0,Uncomplicated,,,1,,1,2,,0,0,,0,0,0,,,0,,15.89999962,,36.40000153,,,,,,,0,0
Gambia 2005_2011,7,,0,Uncomplicated,,,1,,1,1,,0,0,,0,0,0,,,0,,11.69999981,,37,,,,,,,0,0
Gambia 2005_2011,11,,0,Uncomplicated,,,1,,1,2.8,,0,0,,0,0,0,,,0,Alive,13.10000038,0,38.79999924,,,,,,,0,0
Gambia 2005_2011,8,,0,Uncomplicated,,,1,,1,2.8,,0,0,,0,0,0,,,0,Alive,10.10000038,0,37.20000076,,,,,,,0,0
Gambia 2005_2011,11,,0,Uncomplicated,,,1,,1,2,,0,0,,0,0,0,,,0,,11.69999981,,38,,,,,,,0,0
Gambia 2005_2011,13,,0,Uncomplicated,,,1,,1,3,,0,0,,0,0,0,,,0,Alive,12,0,36.59999847,,,,,,,0,0
Gambia 2005_2011,14,,0,Uncomplicated,,,1,,1,3,,0,0,,0,0,0,,,0,Alive,13.39999962,0,37.5,,,,,,,,
Gambia 2005_2011,16,,0,Uncomplicated,,,1,,1,3,,0,0,0,0,0,0,,,0,Alive,12.80000019,0,36.70000076,,,,,,,0,0
Gambia 2005_2011,4,,0,Uncomplicated,,,1,,1,4,,0,0,0,0,0,0,,,0,Alive,13.10000038,0,37.59999847,,,,,,,0,0
Gambia 2005_2011,7,,0,Uncomplicated,,,1,,1,2,,0,0,,0,0,0,,,0,Alive,12,0,39.90000153,,,,,,,0,0
Gambia 2005_2011,1.83,,0,Uncomplicated,,,1,,1,7,,0,0,,0,0,0,,,0,Alive,8.5,0,38.29999924,,,,,,,1,
Gambia 2005_2011,9,,0,Uncomplicated,,,1,,1,4,,0,0,,0,0,0,,,0,Alive,13.60000038,0,37.59999847,,,,,,,1,1
Gambia 2005_2011,7,,0,Uncomplicated,,,1,,1,3,,0,0,,0,0,0,,,0,Alive,11.69999981,0,37.40000153,,,,,,,0,0
Gambia 2005_2011,7,,0,Uncomplicated,,,1,,1,7,,0,0,,0,0,0,,,0,Alive,11.89999962,0,38.29999924,,,,,,,1,
Gambia 2005_2011,7,,0,Uncomplicated,,,1,,1,3,,0,0,,0,0,0,,,0,Alive,12.10000038,0,37.29999924,,,,,,,0,0
Gambia 2005_2011,9,,0,Uncomplicated,,,1,,1,2.8,,0,0,,0,0,0,,,0,Alive,13.89999962,0,38.20000076,,,,,,,0,0
Gambia 2005_2011,7,,0,Uncomplicated,,,1,,1,5,,0,0,,0,0,0,,,0,Alive,7.800000191,0,37.29999924,,,,,,,1,1
Gambia 2005_2011,10,,0,Uncomplicated,,,1,,1,4.8000002,,0,0,,0,0,0,,,0,Alive,12.39999962,0,39.5,,,,,,,0,0
Gambia 2005_2011,12,,0,Uncomplicated,,,1,,1,3.3,,0,0,,0,0,0,,,0,Alive,13,0,36.29999924,,,,,,,0,0
Gambia 2005_2011,13,,0,Uncomplicated,,,1,,1,6,,0,0,0,0,0,0,,,0,Alive,10.5,0,36.40000153,,,,,,,1,
Gambia 2005_2011,1,,0,Uncomplicated,,,1,,1,4,,0,0,,0,0,0,,,0,Alive,10.10000038,0,38.59999847,,,,,,,0,0
Gambia 2005_2011,2,,0,Uncomplicated,,,1,,1,4,,0,0,,0,0,0,,,0,,9.199999809,,36.59999847,,,,,,,1,
Gambia 2005_2011,6,,0,Uncomplicated,,,1,,1,2,,0,0,,0,0,0,,,0,Alive,13.10000038,0,37.70000076,,,,,,,0,0
Gambia 2005_2011,12,,0,Uncomplicated,,,1,,1,3,,0,0,,0,0,0,,,0,Alive,12.30000019,0,38.20000076,,,,,,,0,0
Gambia 2005_2011,1,,0,Uncomplicated,,,1,,1,3.5,,0,0,,0,0,0,,,0,Alive,11.5,0,36.29999924,,,,,,,0,0
Gambia 2005_2011,4,,0,Uncomplicated,,,1,,1,3,,0,0,,0,0,0,,,0,Alive,9,0,36.79999924,,,,,,,0,0
Gambia 2005_2011,13,,0,Uncomplicated,,,1,,1,3.5999999,,0,0,,0,0,0,,,0,Alive,12.10000038,0,36.79999924,,,,,,,1,
Gambia 2005_2011,7,,0,Uncomplicated,,,1,,1,4,,0,0,,0,0,0,,,0,Alive,12.30000019,0,39.5,,,,,,,1,
Gambia 2005_2011,5,,0,Uncomplicated,,,1,,1,3,,0,0,,0,0,0,,,0,Alive,12.30000019,0,37.90000153,,,,,,,0,0
Gambia 2005_2011,4.5,,0,Uncomplicated,,,1,,1,1.3,,0,0,,0,0,0,,,0,Alive,12.80000019,0,36.5,,,,,,,0,0
Gambia 2005_2011,11,,0,Uncomplicated,,,1,,1,2.4000001,,0,0,,0,0,0,,,0,Alive,11.30000019,0,35.79999924,,,,,,,0,0
Gambia 2005_2011,4,,0,Uncomplicated,,,1,,1,2.8,,0,0,,0,0,0,,,0,Alive,12,0,36.09999847,,,,,,,0,0
Gambia 2005_2011,7,,0,Severe,,,1,,1,2.8,,0,0,,0,0,1,,,0,Alive,11,0,36.5,,,,,,,1,
Gambia 2005_2011,15,,0,Uncomplicated,,,1,,1,4,,0,0,,0,0,0,,,0,Alive,13,0,36.5,,,,,,,1,1
Gambia 2005_2011,4.3299999,,0,Uncomplicated,,,1,,1,4.6999998,,0,0,,0,0,0,,,0,Alive,7.800000191,0,37,,,,,,,0,0
Gambia 2005_2011,15,,0,Uncomplicated,,,1,,1,2,,0,0,,0,0,0,,,0,Alive,10,0,36.20000076,,,,,,,0,0
Gambia 2005_2011,10,,0,Uncomplicated,,,1,,1,2,,0,0,,0,0,0,,,0,Alive,11.80000019,0,38.40000153,,,,,,,0,0
Gambia 2005_2011,5,,0,Uncomplicated,,,1,,1,5,,0,0,,0,0,0,,,0,Alive,11.69999981,,37.5,,,,,,,0,0
Gambia 2005_2011,3,,0,Uncomplicated,,,1,,1,5,,0,0,,0,0,,,,0,,12.19999981,,38,,,,,,,,
Gambia 2005_2011,10,,0,Uncomplicated,,,1,,1,4,,0,0,,0,0,0,,,0,Alive,12.10000038,0,36.79999924,,,,,,,0,0
Gambia 2005_2011,7,,0,Uncomplicated,,,1,,1,5,,0,0,0,0,0,0,,,0,Alive,9.300000191,0,38.20000076,,,,,,,0,0
Gambia 2005_2011,2,,0,Uncomplicated,,,1,,1,3,,0,0,0,0,0,0,,,0,Alive,12.5,0,39.09999847,,,,,,,0,0
Gambia 2005_2011,2.5,,0,Uncomplicated,,,1,,1,2,,0,0,,0,0,0,,,0,Alive,10.89999962,0,38.90000153,,,,,,,0,0
Gambia 2005_2011,1,,0,Uncomplicated,,,1,,1,4,,0,0,,0,0,0,,,0,Alive,10.39999962,0,36.70000076,,,,,,,1,1
Gambia 2005_2011,10,,0,Uncomplicated,,,1,,1,3,,0,0,,0,0,0,,,0,Alive,10.80000019,0,38.59999847,,,,,,,0,0
Gambia 2005_2011,8,,0,Uncomplicated,,,1,,1,2,,0,0,,0,0,0,,,0,Alive,9.800000191,0,36.40000153,,,,,,,0,0
Gambia 2005_2011,6.3299999,,0,Uncomplicated,,,1,,1,4.3000002,,0,0,,0,0,0,,,0,Alive,8.5,0,36.70000076,,,,,,,0,0
Gambia 2005_2011,10,,0,Uncomplicated,,,1,,1,4,,0,0,,0,0,0,,,0,Alive,12.39999962,0,37,,,,,,,0,0
Gambia 2005_2011,11,,0,Uncomplicated,,,1,,1,2,,0,0,,0,0,0,,,0,Alive,13.19999981,0,38.79999924,,,,,,,0,0
Gambia 2005_2011,4,,0,Uncomplicated,,,1,,1,2,,0,0,0,0,0,0,,,0,Alive,14.10000038,0,38.09999847,,,,,,,0,0
Gambia 2005_2011,14,,0,Uncomplicated,,,1,,1,2,,0,0,0,0,0,0,,,0,Alive,12.69999981,0,38.5,,,,,,,0,0
Gambia 2005_2011,13,,0,Uncomplicated,,,1,,1,7,,0,0,0,0,0,0,,,0,Alive,11.30000019,0,38.20000076,,,,,,,0,0
Gambia 2005_2011,6.5,,0,Uncomplicated,,,1,,1,3,,0,0,,0,0,0,,,0,Alive,10.19999981,0,39.20000076,,,,,,,1,
Gambia 2005_2011,4,,0,Uncomplicated,,,1,,1,5,,0,0,,0,0,0,,,0,Alive,8.899999619,0,36.09999847,,,,,,,0,0
Gambia 2005_2011,11,,0,Uncomplicated,,,1,,1,7,,0,0,,0,0,0,,,0,Alive,9.800000191,0,39.40000153,,,,,,,0,0
Gambia 2005_2011,8,,0,Uncomplicated,,,1,,1,3,,0,0,,0,0,0,,,0,Alive,13,0,36.40000153,,,,,,,0,0
Gambia 2005_2011,3,,0,Uncomplicated,,,1,,1,7,,0,0,,0,0,0,,,0,Alive,8.399999619,0,36,,,,,,,1,
Gambia 2005_2011,11,,0,Uncomplicated,,,1,,1,3.5,,0,0,,0,0,0,,,0,Alive,12.19999981,0,37.79999924,,,,,,,0,0
Gambia 2005_2011,10,,0,Uncomplicated,,,1,,1,3.2,,0,0,,0,0,0,,,0,Alive,12.30000019,0,35.09999847,,,,,,,1,
Gambia 2005_2011,5,,0,Uncomplicated,,,1,,1,7,,0,0,,0,0,0,,,0,Alive,7.099999905,0,36.40000153,,,,,,,1,
Gambia 2005_2011,11,,0,Uncomplicated,,,1,,1,3,,0,0,,0,0,0,,,0,Alive,12.39999962,0,38.5,,,,,,,0,0
Gambia 2005_2011,9,,0,Uncomplicated,,,1,,1,3,,0,0,,0,0,0,,,0,Alive,13.80000019,0,37.90000153,,,,,,,0,0
Gambia 2005_2011,7,,0,Uncomplicated,,,1,,1,3,,0,0,0,0,0,0,,,0,Alive,11.89999962,0,37.20000076,,,,,,,0,0
Gambia 2005_2011,12,,0,Uncomplicated,,,1,,1,5,,0,0,,0,0,0,0,0,0,Alive,10.69999981,0,37.90000153,,,,,,,,
Gambia 2005_2011,9,,0,Uncomplicated,,,1,,1,3,,0,0,,0,0,0,0,0,0,Alive,10.5,0,37.09999847,,,,,,,0,0
Gambia 2005_2011,14,,0,Uncomplicated,,,1,,1,7,,0,0,,0,0,0,0,0,0,Alive,9,0,39,,,,,,,0,0
Gambia 2005_2011,11,,0,Uncomplicated,,,1,,1,3.7,,0,0,,0,0,0,,,0,Alive,12.30000019,0,36.70000076,,,,,,,0,0
Gambia 2005_2011,9,,0,Uncomplicated,,,1,,1,4,,0,0,,0,0,0,,,0,Alive,10.60000038,0,38.09999847,,,,,,,0,0
Gambia 2005_2011,7,,0,Uncomplicated,,,1,,1,3,,0,0,,0,0,0,,,0,Alive,11.19999981,0,37,,,,,,,0,0
Gambia 2005_2011,8,,0,Uncomplicated,,,1,,1,3,,0,0,,0,0,0,,,0,Alive,10.10000038,0,36,,,,,,,0,0
Gambia 2005_2011,2.8299999,,0,Uncomplicated,,,1,,1,2,,0,0,,0,0,0,,,0,Alive,9.399999619,0,38.90000153,,,,,,,0,0
Gambia 2005_2011,8,,0,Uncomplicated,,,1,,1,3,,0,0,,0,0,0,,,0,Alive,11.69999981,0,39,,,,,,,0,0
Gambia 2005_2011,3,,0,Uncomplicated,,,1,,1,3,,0,0,,0,0,0,,,0,Alive,11.39999962,0,35.5,,,,,,,0,0
Gambia 2005_2011,5,,0,Uncomplicated,,,1,,1,4,,0,0,,0,0,0,,,0,Alive,7.800000191,0,37.5,,,,,,,0,0
Gambia 2005_2011,8,,0,Severe,,,1,,1,3,,0,0,,0,0,1,,,0,Alive,12.39999962,0,37.79999924,,,,,,,0,0
Gambia 2005_2011,3,,0,Uncomplicated,,,1,,1,3,,0,0,,0,0,0,,,0,Alive,9.800000191,0,37.40000153,,,,,,,0,0
Gambia 2005_2011,6,,0,Uncomplicated,,,1,,1,7,,0,0,,0,0,0,,,0,Alive,8.399999619,0,36.90000153,,,,,,,0,0
Gambia 2005_2011,15,,0,Uncomplicated,,,1,,1,2.5,,0,0,,0,0,0,,,0,Alive,16.60000038,0,36.29999924,,,,,,,0,0
Gambia 2005_2011,8,,0,Uncomplicated,,,1,,1,3,,0,0,,0,0,0,,,0,,8.300000191,,36,,,,,,,1,
Gambia 2005_2011,13,,0,Uncomplicated,,,1,,1,3,,0,0,,0,0,0,0,0,0,Alive,11.60000038,0,39.40000153,,,,,,,0,0
Gambia 2005_2011,12,,0,Uncomplicated,,,1,,1,2.5,,0,0,,0,0,0,,,0,Alive,14.39999962,0,36.59999847,,,,,,,0,0
Gambia 2005_2011,2,,0,Uncomplicated,,,1,,1,7,,0,0,,0,0,0,,,0,Alive,11.5,0,37.70000076,,,,,,,1,
Gambia 2005_2011,12,,0,Uncomplicated,,,1,,1,3,,0,0,0,0,0,0,,,0,Alive,10.5,0,37,,,,,,,0,0
Gambia 2005_2011,7,,0,Uncomplicated,,,1,,1,3,,0,0,0,0,0,0,,,0,Alive,16.10000038,0,39.09999847,,,,,,,0,0
Gambia 2005_2011,8,,0,Uncomplicated,,,1,,1,5,,0,0,0,0,0,0,,,0,Alive,12.19999981,0,37.20000076,,,,,,,1,
Gambia 2005_2011,1.91,,0,Uncomplicated,,,1,,1,3,,0,0,,0,0,0,,,0,Alive,9,0,38.20000076,,,,,,,0,0
Gambia 2005_2011,6,,0,Uncomplicated,,,1,,1,3,,0,0,,0,0,0,0,0,0,Alive,10.10000038,0,39.09999847,,,,,,,,
Gambia 2005_2011,11,,0,Uncomplicated,,,1,,1,2,,0,0,,0,0,0,0,0,0,Alive,12.89999962,0,36.90000153,,,,,,,0,0
Gambia 2005_2011,4,,0,Uncomplicated,,,1,,1,2,,0,0,,0,0,0,,,0,Alive,10.69999981,0,38.59999847,,,,,,,0,0
Gambia 2005_2011,8,,0,Uncomplicated,,,1,,1,2,,0,0,,0,0,0,,,0,Alive,12.89999962,0,39.59999847,,,,,,,0,0
Gambia 2005_2011,5,,0,Severe,,,1,,1,1.6,,0,0,,0,0,1,,,0,Alive,11.89999962,0,38.40000153,,,,,,,0,0
Gambia 2005_2011,16,,0,Uncomplicated,,,1,,1,3,,0,,,0,0,0,,,0,Alive,,0,39.29999924,,,,,,,0,0
Gambia 2005_2011,8,,0,Uncomplicated,,,1,,1,2.5,,0,0,,0,0,0,,,0,Alive,14.69999981,0,37,,,,,,,0,0
Gambia 2005_2011,14,,0,Uncomplicated,,,1,,1,3,,0,0,,0,0,0,,,0,Alive,12.30000019,0,39.09999847,,,,,,,0,0
Gambia 2005_2011,12,,0,Uncomplicated,,,1,,1,4,,0,0,,0,0,0,,,0,Alive,13.30000019,0,39.40000153,,,,,,,0,0
Gambia 2005_2011,13,,0,Uncomplicated,,,1,,1,2,,0,0,,0,0,0,,,0,Alive,12.60000038,0,38.59999847,,,,,,,0,0
Gambia 2005_2011,8,,0,Uncomplicated,,,1,,1,3,,0,0,,0,0,0,,,0,Alive,12.5,0,38.90000153,,,,,,,0,0
Gambia 2005_2011,7,,0,Uncomplicated,,,1,,1,3,,0,0,,0,0,0,,,0,Alive,11.30000019,0,39.29999924,,,,,,,0,0
Gambia 2005_2011,14,,0,Uncomplicated,,,1,,1,2,,0,0,,0,0,0,,,0,,11.39999962,,38.5,,,,,,,0,0
Gambia 2005_2011,2.25,,0,Uncomplicated,,,1,,1,3,,0,0,,0,0,0,,,0,Alive,8.199999809,0,37.5,,,,,,,0,0
Gambia 2005_2011,11,,0,Uncomplicated,,,1,,1,2,,0,0,0,0,0,0,,,0,Alive,9.199999809,0,37.29999924,,,,,,,0,0
Gambia 2005_2011,10,,0,Uncomplicated,,,1,,1,3,,0,0,,0,0,0,0,0,0,Alive,8.899999619,0,39.70000076,,,,,,,0,0
Gambia 2005_2011,3,,0,Uncomplicated,,,1,,1,3,,0,0,,0,0,0,,,0,Alive,10.60000038,0,37.70000076,,,,,,,0,0
Gambia 2005_2011,2,,0,Uncomplicated,,,1,,1,2,,0,0,,0,0,0,,,0,Alive,11.60000038,0,39.20000076,,,,,,,0,0
Gambia 2005_2011,6,,0,Uncomplicated,,,1,,1,2,,0,0,,0,0,0,,,0,Alive,11.60000038,0,37.59999847,,,,,,,0,0
Gambia 2005_2011,9,,0,Severe,,,1,,1,3,,0,0,,0,0,1,,,0,Alive,11.5,0,39.09999847,,,,,,,0,0
Gambia 2005_2011,8,,0,Uncomplicated,,,1,,1,2,,0,0,,0,0,0,,,0,Alive,11.89999962,0,38.5,,,,,,,0,0
Gambia 2005_2011,2.5,,0,Severe,,,1,,1,2,,0,0,,0,0,1,,,0,Alive,11,0,38,,,,,,,0,0
Gambia 2005_2011,12,,0,Severe,,,1,,1,1,,0,0,,0,0,1,,,0,Alive,12.60000038,0,39.40000153,,,,,,,0,0
Gambia 2005_2011,13,,0,Uncomplicated,,,1,,1,3,,0,,,0,0,0,,,0,Alive,,0,39.29999924,,,,,,,0,0
Gambia 2005_2011,4,,0,Uncomplicated,,,1,,1,3,,0,0,,0,0,0,,,0,Alive,13,0,37.70000076,,,,,,,0,0
Gambia 2005_2011,11,,0,Uncomplicated,,,1,,1,2,,0,0,,0,0,0,,,0,Alive,10.60000038,0,39,,,,,,,0,0
Gambia 2005_2011,9,,0,Uncomplicated,,,1,,1,4,,0,0,,0,0,0,,,0,Alive,11.60000038,0,39,,,,,,,0,0
Gambia 2005_2011,12,,0,Uncomplicated,,,1,,1,2,,0,0,,0,0,0,0,0,0,Alive,10.39999962,0,36.5,,,,,,,0,0
Gambia 2005_2011,6,,0,Uncomplicated,,,1,,1,2.8,,0,0,,0,0,0,,,0,Alive,11.19999981,0,38.09999847,,,,,,,0,0
Gambia 2005_2011,3,,0,Uncomplicated,,,1,,1,4,,0,0,,0,0,0,,,0,Alive,8.100000381,0,39.29999924,,,,,,,0,0
Gambia 2005_2011,10,,0,Uncomplicated,,,1,,1,2,,0,0,,0,0,0,,,0,Alive,8.199999809,0,37.5,,,,,,,0,0
Gambia 2005_2011,8,,0,Uncomplicated,,,1,,1,3,,0,0,0,0,0,0,,,0,Alive,10.5,0,38.90000153,,,,,,,0,0
Gambia 2005_2011,5,,0,Uncomplicated,,,1,,1,2,,0,0,,0,0,0,,,0,Alive,9.899999619,1,38.5,,,,,,,0,0
Gambia 2005_2011,5,,0,Uncomplicated,,,1,,1,2,,0,0,,0,0,0,,,0,Alive,13.19999981,0,38.70000076,,,,,,,0,0
Gambia 2005_2011,9,,0,Uncomplicated,,,1,,1,7,,0,0,,0,0,0,0,0,0,Alive,10.5,0,39.59999847,,,,,,,1,
Gambia 2005_2011,4,,0,Uncomplicated,,,1,,1,2,,0,,,0,0,0,,,0,Alive,,0,39.70000076,,,,,,,0,0
Gambia 2005_2011,12,,0,Uncomplicated,,,1,,1,4,,0,0,,0,0,0,,,0,Alive,12.39999962,0,37.09999847,,,,,,,0,0
Gambia 2005_2011,7,,0,Uncomplicated,,,1,,1,3,,0,0,,0,0,0,,,0,Alive,8,0,39.29999924,,,,,,,1,
Gambia 2005_2011,10,,0,Uncomplicated,,,1,,1,7,,0,0,,0,0,0,,,0,Alive,10.5,0,39.59999847,,,,,,,1,1
Gambia 2005_2011,6.75,,0,Uncomplicated,,,1,,1,3.8,,0,0,,0,0,0,,,0,Alive,10.10000038,0,38,,,,,,,1,
Gambia 2005_2011,9,,0,Uncomplicated,,,1,,1,2.8,,0,0,,0,0,0,,,0,Alive,13.19999981,0,36.29999924,,,,,,,0,0
Gambia 2005_2011,14,,0,Uncomplicated,,,1,,1,3.3,,0,0,,0,0,0,,,0,Alive,8.800000191,0,37.40000153,,,,,,,0,0
Gambia 2005_2011,7,,0,Uncomplicated,,,1,,1,2.8,,0,0,,0,0,0,,,0,Alive,12,0,38.59999847,,,,,,,0,0
Gambia 2005_2011,9,,0,Uncomplicated,,,1,,1,2,,0,0,,0,0,0,,,0,Alive,11.69999981,0,38.29999924,,,,,,,0,0
Gambia 2005_2011,3,,0,Severe,,,1,,1,2,,0,0,,0,0,1,,,0,Alive,12.39999962,0,39.90000153,,,,,,,0,0
Gambia 2005_2011,7,,0,Uncomplicated,,,1,,1,3,,0,0,,0,0,0,,,0,Alive,12.89999962,0,36.20000076,,,,,,,0,0
Gambia 2005_2011,5,,0,Uncomplicated,,,1,,1,3,,0,0,,0,0,0,,,0,Alive,11.80000019,0,39.59999847,,,,,,,0,0
Gambia 2005_2011,5,,0,Uncomplicated,,,1,,1,3,,0,0,0,0,0,0,,,0,Alive,6.699999809,0,38.90000153,,,,,,,0,0
Gambia 2005_2011,12,,0,Uncomplicated,,,1,,1,2,,0,0,0,0,0,0,,,0,Alive,10.39999962,0,38.09999847,,,,,,,0,0
Gambia 2005_2011,11,,0,Uncomplicated,,,1,,1,3,,0,0,,0,0,0,,,0,Alive,13.30000019,0,38.5,,,,,,,0,0
Gambia 2005_2011,4,,0,Severe,,,1,,1,2,,0,0,,0,0,1,,,0,Alive,11.89999962,0,39.40000153,,,,,,,,
Gambia 2005_2011,4,,0,Severe,,,1,,1,2,,0,0,,0,0,1,0,0,0,Alive,7.699999809,0,36.5,,,,,,,0,0
Gambia 2005_2011,4,,0,Uncomplicated,,,1,,1,2,,0,,,0,0,0,,,0,Alive,,0,39.70000076,,,,,,,1,
Gambia 2005_2011,4,,0,Uncomplicated,,,1,,1,2,,0,0,,0,0,0,,,0,Alive,12.60000038,0,38.5,,,,,,,1,
Gambia 2005_2011,8,,0,Uncomplicated,,,1,,1,2.5999999,,0,0,,0,0,0,,,0,Alive,10,0,40.09999847,,,,,,,0,0
Gambia 2005_2011,16,,0,Uncomplicated,,,1,,1,2.5999999,,0,0,,0,,0,,,0,Alive,12.10000038,0,40.29999924,,,,,,,0,0
Gambia 2005_2011,13,,0,Uncomplicated,,,1,,1,2.8,,0,0,,0,0,0,,,0,Alive,12,0,40.09999847,,,,,,,0,0
Gambia 2005_2011,10,,0,Uncomplicated,,,1,,1,3,,0,0,,0,,0,,,0,Alive,11.30000019,0,37.09999847,,,,,,,0,0
Gambia 2005_2011,2,,0,Uncomplicated,,,1,,1,1,,0,0,,0,0,0,,,0,Alive,7.699999809,0,39.59999847,,,,,,,0,0
Gambia 2005_2011,13,,0,Uncomplicated,,,1,,1,2,,0,0,0,0,0,0,,,0,Alive,12.19999981,0,38.5,,,,,,,0,0
Gambia 2005_2011,10,,0,Uncomplicated,,,1,,1,2,,0,0,,0,0,0,,,0,Alive,14.39999962,0,37.29999924,,,,,,,0,0
Gambia 2005_2011,6,,0,Uncomplicated,,,1,,1,2.7,,0,0,,0,0,0,,,0,Alive,9,0,37.40000153,,,,,,,1,
Gambia 2005_2011,3,,0,Uncomplicated,,,1,,1,2.2,,0,0,,0,0,0,,,0,Alive,9.899999619,0,37.79999924,,,,,,,0,0
Gambia 2005_2011,6,,0,Uncomplicated,,,1,,1,3,,0,0,,0,0,0,,,0,Alive,12.19999981,0,37.5,,,,,,,,
Gambia 2005_2011,9,,0,Uncomplicated,,,1,,1,1,,0,0,,0,0,,,,0,,12.60000038,,38.90000153,,,,,,,0,0
Gambia 2005_2011,3,,0,Uncomplicated,,,1,,1,3,,0,0,,0,0,0,,,0,Alive,9.600000381,0,36.5,,,,,,,0,0
Gambia 2005_2011,7,,0,Uncomplicated,,,1,,1,7,,0,0,,0,0,0,,,0,Alive,11.69999981,0,37.5,,,,,,,1,
Gambia 2005_2011,13,,0,Uncomplicated,,,1,,1,3,,0,0,,0,0,0,,,0,Alive,15.80000019,0,37.20000076,,,,,,,0,0
Gambia 2005_2011,7,,0,Uncomplicated,,,1,,1,2,,0,0,,0,0,0,,,0,Alive,9.699999809,0,38.40000153,,,,,,,0,0
Gambia 2005_2011,0.75,,0,Uncomplicated,,,1,,1,2.3,,0,0,,0,0,0,,,0,Alive,9.399999619,0,36.70000076,,,,,,,0,0
Gambia 2005_2011,2,,0,Uncomplicated,,,1,,1,3,,0,0,,0,0,0,,,0,Alive,7.699999809,0,37.40000153,,,,,,,0,0
Gambia 2005_2011,15,,0,Uncomplicated,,,1,,1,3,,0,0,,0,0,0,,,0,,15.39999962,,35.09999847,,,,,,,,
Gambia 2005_2011,12,,0,Uncomplicated,,,1,,1,1,,0,0,,0,0,0,,,0,Alive,13.89999962,0,38.20000076,,,,,,,0,0
Gambia 2005_2011,4,,0,Uncomplicated,,,1,,1,6,,0,0,0,0,0,0,,,0,Alive,8.800000191,0,38.40000153,,,,,,,1,1
Gambia 2005_2011,5,,0,Severe,,,1,,1,3,,0,0,,0,0,1,,,0,Alive,14,0,37.90000153,,,,,,,0,0
Gambia 2005_2011,12,,0,Severe,,,1,,1,3.2,,0,0,,0,0,1,,,0,Alive,10.39999962,0,36.70000076,,,,,,,0,0
Gambia 2005_2011,13,,0,Uncomplicated,,,1,,1,3,,0,0,,0,0,0,,,0,Alive,14.10000038,0,38.40000153,,,,,,,0,0
Gambia 2005_2011,6,,0,Uncomplicated,,,1,,1,2.8,,0,0,,0,0,0,,,0,Alive,13.30000019,0,38.20000076,,,,,,,1,
Gambia 2005_2011,6,,0,Uncomplicated,,,1,,1,3.7,,0,0,,0,,0,,,0,Alive,9.199999809,0,39.79999924,,,,,,,0,0
Gambia 2005_2011,5,,0,Severe,,,1,,1,3,,0,0,,0,0,1,,,0,Alive,13.19999981,0,38.5,,,,,,,0,0
Gambia 2005_2011,1.33,,0,Uncomplicated,,,1,,1,3,,0,0,,0,0,0,,,0,Alive,5.800000191,0,38.20000076,,,,,,,0,0
Gambia 2005_2011,12,,0,Uncomplicated,,,1,,1,2,,0,0,,0,0,0,0,0,0,Alive,12.10000038,0,39,,,,,,,0,0
Gambia 2005_2011,5,,0,Uncomplicated,,,1,,1,3,,0,0,,0,0,0,,,0,Alive,11.80000019,0,39.40000153,,,,,,,0,0
Gambia 2005_2011,4,,0,Uncomplicated,,,1,,1,2.7,,0,0,,0,0,0,,,0,Alive,11.80000019,0,39.40000153,,,,,,,0,0
Gambia 2005_2011,2,,0,Severe,,,1,,1,3,,0,0,0,0,0,1,,,1,Alive,10.5,0,39.20000076,,,,,,,0,0
Gambia 2005_2011,8,,0,Uncomplicated,,,1,,1,3,,0,0,,0,0,0,,,0,Alive,12.39999962,0,40,,,,,,,0,0
Gambia 2005_2011,8,,0,Uncomplicated,,,1,,1,3,,0,0,,0,0,0,,,0,Alive,11.89999962,0,39.70000076,,,,,,,0,0
Gambia 2005_2011,5,,0,Uncomplicated,,,1,,1,7,,0,0,,0,0,0,,,0,Alive,10.5,0,37.79999924,,,,,,,0,0
Gambia 2005_2011,5,,0,Uncomplicated,,,1,,1,2,,0,0,0,0,0,0,,,0,Alive,10.39999962,0,39,,,,,,,0,0
Gambia 2005_2011,5,,0,Uncomplicated,,,1,,1,2,,0,0,,0,0,0,,,0,Alive,11,0,37.90000153,,,,,,,0,0
Gambia 2005_2011,5,,0,Severe,,,1,,1,2,,0,0,,0,0,1,0,1,0,Alive,8.800000191,0,39.29999924,,,,,,,0,0
Gambia 2005_2011,4,,0,Uncomplicated,,,1,,1,1.6,,0,0,,0,0,0,,,0,,11.39999962,0,39.70000076,,,,,,,0,0
Gambia 2005_2011,4,,0,Uncomplicated,,,1,,1,2.2,,0,0,,0,0,0,,,0,Alive,5.800000191,0,36.5,,,,,,,1,1
Gambia 2005_2011,10,,0,Uncomplicated,,,1,,1,1,,0,0,,0,0,0,,,0,Alive,13.89999962,0,37.59999847,,,,,,,0,0
Gambia 2005_2011,13,,0,Uncomplicated,,,1,,1,3,,0,0,,0,0,0,,,0,,11.10000038,,38.59999847,,,,,,,0,0
Gambia 2005_2011,4,,0,Severe,,,1,,1,3,,0,0,,0,0,1,,,0,Alive,10.19999981,0,38.90000153,,,,,,,0,0
Gambia 2005_2011,5,,0,Uncomplicated,,,1,,1,4.5,,0,0,,0,0,0,,,0,Alive,12.69999981,0,36.59999847,,,,,,,0,0
Gambia 2005_2011,9,,0,Uncomplicated,,,1,,1,2,,0,0,0,0,0,0,,,0,Alive,13.60000038,0,38.59999847,,,,,,,0,0
Gambia 2005_2011,7,,0,Uncomplicated,,,1,,1,4,,0,0,,0,0,0,0,0,0,,11.30000019,,38.79999924,,,,,,,,
Gambia 2005_2011,7.8299999,,0,Uncomplicated,,,1,,1,2.2,,0,0,,0,0,0,,,0,Alive,9.800000191,0,38,,,,,,,0,0
Gambia 2005_2011,6,,0,Severe,,,1,,1,1.6,,0,0,,0,0,1,,,0,Alive,11,0,37.40000153,,,,,,,0,0
Gambia 2005_2011,12,,0,Uncomplicated,,,1,,1,3,,0,0,,0,0,0,,,0,Alive,14,0,39.5,,,,,,,0,0
Gambia 2005_2011,2,,0,Uncomplicated,,,1,,1,2,,0,0,0,0,0,0,,,0,Alive,8.600000381,0,39.90000153,,,,,,,1,1
Gambia 2005_2011,0.82999998,,0,Severe,,,1,,1,3,,0,0,0,0,0,1,,,0,Alive,8.699999809,0,38.59999847,,,,,,,0,0
Gambia 2005_2011,9,,0,Uncomplicated,,,1,,1,5,,0,0,,0,0,0,,,0,Alive,10.69999981,0,38.70000076,,,,,,,0,0
Gambia 2005_2011,7,,0,Uncomplicated,,,1,,1,4.8000002,,0,0,,0,0,0,,,0,Alive,11.80000019,0,39.79999924,,,,,,,0,0
Gambia 2005_2011,4,,0,Uncomplicated,,,1,,1,2,,0,0,,0,0,0,,,0,Alive,12.30000019,0,37.70000076,,,,,,,0,0
Gambia 2005_2011,5,,0,Uncomplicated,,,1,,1,3,,0,0,0,0,0,0,,,0,Alive,15.80000019,0,40.09999847,,,,,,,0,0
Gambia 2005_2011,2,,0,Uncomplicated,,,1,,1,2,,0,0,,0,0,0,,,0,Alive,10.5,0,39.09999847,,,,,,,1,1
Gambia 2005_2011,9,,0,Uncomplicated,,,1,,1,2.4000001,,0,0,,0,0,0,,,0,Alive,13.10000038,0,39.70000076,,,,,,,0,0
Gambia 2005_2011,8,,0,Severe,,,1,,1,1,,0,0,,0,0,0,1,0,0,Alive,13.10000038,0,39.20000076,,,,,,,0,0
Gambia 2005_2011,10,,0,Uncomplicated,,,1,,1,2,,0,0,,0,0,0,,,0,Alive,13.5,0,40,,,,,,,0,0
Gambia 2005_2011,9,,0,Uncomplicated,,,1,,1,2.5999999,,0,0,,0,0,0,,,0,Alive,11.39999962,0,39.20000076,,,,,,,0,0
Gambia 2005_2011,5,,0,Severe,,,1,,1,3,,0,0,0,0,0,1,,,0,Alive,10.69999981,0,37.59999847,,,,,,,0,0
Gambia 2005_2011,4.5799999,,0,Severe,,,1,,1,3,,0,0,,0,0,1,0,1,0,Alive,16.79999924,0,38.29999924,,,,,,,0,0
Gambia 2005_2011,6,,0,Severe,,,1,,1,3,,0,0,,0,0,1,,,0,,13.80000019,0,39.40000153,,,,,,,,
Gambia 2005_2011,2.4100001,,0,Uncomplicated,,,1,,1,4.5,,0,0,,0,0,0,,,0,Alive,9.100000381,0,38,,,,,,,0,0
Gambia 2005_2011,3,,0,Severe,,,1,,1,5,,0,0,,0,0,1,,,0,Alive,7,0,37.90000153,,,,,,,,
Gambia 2005_2011,5.4099998,,0,Uncomplicated,,,1,,1,1,,0,0,,0,0,0,,,0,Alive,12.30000019,0,38.79999924,,,,,,,0,0
Gambia 2005_2011,15,,0,Severe,,,1,,1,4,,0,0,,0,0,1,,,0,Alive,9.600000381,0,37.59999847,,,,,,,0,0