frag_no,region,plant,part,medium,well,plant2,part2,medium2,fragment,isolate,mycelium_color,mycelium_color_under,mycelium_texture,sclerotia,spores,media_coloring,sequence,genusNCBI,speciesNCBI,MatchNCBI,identityNCBI,genusUNITE,speciesUNITE,lineageUNITE,lengthUNITE,identityUNITE,MatchUNITE,lengthNCBI,species,genus,length,identity,phylum,class,order,family
1,m,1,L,1,1,m1,m1L,m1L1,m1L11,m1L11,"w, o",,,,,,TCAGAAGTTGGGTGTTTTACGGCGTGGCCACGTCGGGGTTCCGGTGCGAGTTGGATTACTACGCAGAGGTCGCCGCGGACGGGCCGCCACTCCATTTCGGGGCCGGCGGTATGCTGCCGTTCCCCAACGCCGATTTCCCCAAAGGAAAGTCGAGGGTTGAAATGACGCTCGAACAGGCATGCCCGCCAGAATGCTGGCGGCG,Lecanicillium,Lecanicillium_muscarium,NR_111096.1 Lecanicillium muscarium IMI 068689 ITS region; from TYPE material,99.5,Lecanicillium,Lecanicillium_muscarium,k__Fungi;p__Ascomycota;c__Sordariomycetes;o__Hypocreales;f__Cordycipitaceae;g__Lecanicillium;s__Lecanicillium_muscarium,200,99.5,Lecanicillium_muscarium|AJ292388|SH123219.07FU|refs|k__Fungi;p__Ascomycota;c__Sordariomycetes;o__Hypocreales;f__Cordycipitaceae;g__Lecanicillium;s__Lecanicillium_muscarium,200,Lecanicillium_muscarium,Lecanicillium,200,99.5,Ascomycota,Sordariomycetes,Hypocreales,Cordycipitaceae
2,m,1,L,1,2,m1,m1L,m1L1,m1L12,m1L12,dk g,,"fl, ia",,,,TCAAAAGTTGAAAAAAGGCTTTGTGGATGCTGACCTTTGCTGGAAGAGAGCGCGACTTGTGCTGCGCTCCGAAACCAGTAGGCCGGCTGCCAATTACTTTAAGGCGAGTCTCCAGCAAACTGGAGACAAGACGCCCAACACCAAGCAAAGCTTGAGGGTACAAATGACGCTCGAACAGGCATGCCCTTTGGAATACCAAAGGGCGCAATGTGCGTTCAAAGATTCGATGATTCACTGAATTCTGCAATTCACACTACTTATCGCATTTCGCTGCGTTCTTCATCGATGCCAGAACCAAGAGATCCGTTGTTGAAAGTTGTAATTATTATGTTGTTACTGACGCTGATTGCAATTACAAAAGGTTTAATGGTTTGTCCTTGTGGTGGGCGAACCCACCAAGGAAACAAGAAG,Alternaria,Alternaria_nepalensis,NR_136046.1 Alternaria nepalensis CBS 118700 ITS region; from TYPE material,100,unidentified,Dothideomycetes_sp,k__Fungi;p__Ascomycota;c__Dothideomycetes;o__unidentified;f__unidentified;g__unidentified;s__Dothideomycetes_sp,406,98.522,Dothideomycetes_sp|KC584183|SH216784.07FU|reps|k__Fungi;p__Ascomycota;c__Dothideomycetes;o__unidentified;f__unidentified;g__unidentified;s__Dothideomycetes_sp,411,Alternaria_nepalensis,Alternaria,411,100,Ascomycota,Dothideomycetes,Pleosporales,Pleosporaceae
3,m,1,L,1,3,m1,m1L,m1L1,m1L13,m1L13,dk g,,,,,,TCAAAAGTTGAAAAAAGGCTTTGTGGATGCTGACCTTTGCTGGAAGAGAGCGCGACTTGTGCTGCGCTCCGAAACCAGTAGGCCGGCTGCCAATTACTTTAAGGCGAGTCTCCAGCAAACTGGAGACAAGACGCCCAACACCAAGCAAAGCTTGAGGGTACAAATGACGCTCGAACAGGCATGCCCTTTGGAATACCAAAGGGCGCAATGTGCGTTCAAAGATTCGATGATTCACTGAATTCTGCAATTCACACTACTTATCGCATTTCGCTGCGTTCTTCATCGATGCCAGAACCAAGAGATCCGTTGTTGAAAGTTGTAATTATTATGTTGTTACTGACGCTGATTGCAATTACAAAAGGTTTAATGGTTTGTCCTTGTGGTGGGCGAACCCACCAAGGAAACAAGAAG,Alternaria,Alternaria_nepalensis,NR_136046.1 Alternaria nepalensis CBS 118700 ITS region; from TYPE material,100,unidentified,Dothideomycetes_sp,k__Fungi;p__Ascomycota;c__Dothideomycetes;o__unidentified;f__unidentified;g__unidentified;s__Dothideomycetes_sp,406,98.522,Dothideomycetes_sp|KC584183|SH216784.07FU|reps|k__Fungi;p__Ascomycota;c__Dothideomycetes;o__unidentified;f__unidentified;g__unidentified;s__Dothideomycetes_sp,411,Alternaria_nepalensis,Alternaria,411,100,Ascomycota,Dothideomycetes,Pleosporales,Pleosporaceae
4,m,1,L,1,4,m1,m1L,m1L1,m1L14,m1L14,,,,,,,,,,,,,,,,,,,,,,,,,,
5,m,1,L,1,5,m1,m1L,m1L1,m1L15,m1L151,"b, g",,,,,,,,,,,,,,,,,,,,,,,,,
5,m,1,L,1,5,m1,m1L,m1L1,m1L15,m1L152,"bl, g",,,,"bl, vis, conc",,CAAAAGTTGAAAAAAGGCTTAATGGATGCTAGACCTTTGCTGATAGAGAGTGCGACTTGTGCTGCGCTCCGAAACCAGTAGGCCGGCTGCCAATTACTTTAAGGCGAGTCTCCAGCAAAGCTAGAGACAAGACGCCCAACACCAAGCAAAGCTTGAGGGTACAAATGACGCTCGAACAGGCATGCCCTTTGGAATACCAAAGGGCGCAATGTGCGTTCAAAGATTCGATGATTCACTGAATTCTGCAATTCACACTACTTATCGCATTTCGCTGCGTTCTTCATCGATGCCAGAACCAAGAGATCCGTTGTTGAAAGTTGTAATTATTAATTTGTTACTGACGCTGATTGCAATTACAAAAGGTTTATGTTTGTCCTAGTGGTGGGCGAACCCACCAAGGAAACAAGAAGTACGCAAAAGACAAGGGTGAATAATTCAGCAAGGCTGTAACCCCGAGAGGTTCCAGCCCGCCT,Alternaria,Alternaria_arborescens,NR_135927.1 Alternaria arborescens CBS 102605 ITS region; from TYPE material,100,Alternaria,Alternaria_alternata,k__Fungi;p__Ascomycota;c__Dothideomycetes;o__Pleosporales;f__Pleosporaceae;g__Alternaria;s__Alternaria_alternata,470,99.787,Alternaria_alternata|KF465761|SH429908.07FU|refs|k__Fungi;p__Ascomycota;c__Dothideomycetes;o__Pleosporales;f__Pleosporaceae;g__Alternaria;s__Alternaria_alternata,473,Alternaria_alternata,Alternaria,470,99.787,Ascomycota,Dothideomycetes,Pleosporales,Pleosporaceae
6,m,1,L,1,6,m1,m1L,m1L1,m1L16,m1L16,,,,,,,,,,,,,,,,,,,,,,,,,,
7,m,1,L,a,1,m1,m1L,m1La,m1La1,m1La1,,,,,,,,,,,,,,,,,,,,,,,,,,
8,m,1,L,a,2,m1,m1L,m1La,m1La2,m1La2,g,,,ia,,,GATCCGAGGTCAAAAGTTAAAAAATGTGGTCTTGATGGATGCTCAACCAAGGCTGATTCAAAGTGCAAGAATTGTGCTGCGCTCCGAAACCAGTAGGTCGGCTGCCAATCATTTTAAGGCGAGTCTCGTGAGAGACAAAGACGCCCAACACCAAGCAAAGCTTGAGGGTACAAATGACGCTCGAACAGGCATGCCCTTTGGAATACCA,Stemphylium,Stemphylium_vesicarium,NR_111243.1 Stemphylium vesicarium CBS 191.86 ITS region; from synonym TYPE material,99.519,Stemphylium,Stemphylium_herbarum,k__Fungi;p__Ascomycota;c__Dothideomycetes;o__Pleosporales;f__Pleosporaceae;g__Stemphylium;s__Stemphylium_herbarum,205,99.024,Stemphylium_herbarum|DQ491516|SH387143.07FU|refs|k__Fungi;p__Ascomycota;c__Dothideomycetes;o__Pleosporales;f__Pleosporaceae;g__Stemphylium;s__Stemphylium_herbarum,208,Stemphylium_herbarum,Stemphylium,205,99.024,Ascomycota,Dothideomycetes,Pleosporales,Pleosporaceae
9,m,1,L,a,3,m1,m1L,m1La,m1La3,m1La3,,,,,,,,,,,,,,,,,,,,,,,,,,
10,m,1,L,a,4,m1,m1L,m1La,m1La4,m1La4,,,,,,,,,,,,,,,,,,,,,,,,,,
11,m,1,L,a,5,m1,m1L,m1La,m1La5,m1La5,bl,,,,"bl, vis",,GGTCAAAAGTTGAAAAAGGCTTAATGGATGCTAGACCTTTGCTGATAGAGAGTGCGACTTGTGCTGCGCTCCGAAACCAGTAGGCCGGCTGCCAATTACTTTAAGGCGAGTCTCCAGCAAAGCTAGAGACAAGACGCCCAACACCAAGCAAAGCTTGAGGGTACAAATGACGCTCGAACAGGCATGCCCTTTGGAATACCAAAGGGCGCAATGTGCGTTCAAAGATTCGATGATTCACTGAATTCTGCAATTCACACTACTTATCGCATTTCGCTGCGTTCTTCATCGATGCCAGAACCAAGAGATCCGTTGTTGAAAGTTGTAATTATTAATTTGTTACTGACGCTGATTGCAATTACAAAAGGTTTATGTTTGTCCTAGTGGTGGGCGAACCCACCAAGGAAACAAGAAGTACGCAAAAGACAAGGTTGAATAATTCAGCAAGGCTGTAACCCCGAGAGGTTCCAGCCCGCCTTCATATTTGTGAAAAGATCCCTCCGCAGGTTCACCTGCGGA,Alternaria,Alternaria_alternata,NR_131316.1 Alternaria alternata CBS 916.96 ITS region; from verified material,98.842,Alternaria,Alternaria_alternata,k__Fungi;p__Ascomycota;c__Dothideomycetes;o__Pleosporales;f__Pleosporaceae;g__Alternaria;s__Alternaria_alternata,481,99.376,Alternaria_alternata|KF465761|SH429908.07FU|refs|k__Fungi;p__Ascomycota;c__Dothideomycetes;o__Pleosporales;f__Pleosporaceae;g__Alternaria;s__Alternaria_alternata,518,Alternaria_alternata,Alternaria,481,99.376,Ascomycota,Dothideomycetes,Pleosporales,Pleosporaceae
12,m,1,L,a,6,m1,m1L,m1La,m1La6,m1La6,,,,,,,GATCCGAGGTCAAAAGTTAAAAAATGTGGTCTTGATGGATGCTCAACCAAGGCTGATTCAAAGTGCAAGAATTGTGCTGCGCTCCGAAACCAGTAGGTCGGCTGCCAATCATTTTAAGGCGAGTCTCGTGAGAGACAAAGACGCCCAACACCAAGCAAAGCTTGAGGGTACAAATGACGCTCGAACAGGCATGCCCTTTGGAATACCA,Stemphylium,Stemphylium_vesicarium,NR_111243.1 Stemphylium vesicarium CBS 191.86 ITS region; from synonym TYPE material,99.519,Stemphylium,Stemphylium_herbarum,k__Fungi;p__Ascomycota;c__Dothideomycetes;o__Pleosporales;f__Pleosporaceae;g__Stemphylium;s__Stemphylium_herbarum,205,99.024,Stemphylium_herbarum|DQ491516|SH387143.07FU|refs|k__Fungi;p__Ascomycota;c__Dothideomycetes;o__Pleosporales;f__Pleosporaceae;g__Stemphylium;s__Stemphylium_herbarum,208,Stemphylium_herbarum,Stemphylium,205,99.024,Ascomycota,Dothideomycetes,Pleosporales,Pleosporaceae
13,m,1,L,p,1,m1,m1L,m1Lp,m1Lp1,m1Lp1,,,,,,,,,,,,,,,,,,,,,,,,,,
14,m,1,L,p,2,m1,m1L,m1Lp,m1Lp2,m1Lp2,"w, g",,sw fl,ia,,,AGTTGAAAAAAATGTGGTCTTGATGGATGCTCAACCAAGGCTGATTCAAAGTGCAAGAATTGTGCTGCGCTCCGAAACCAGTAGGTCGGCTGCCAATCATTTTAAGGCGAGTCTCGTGAGAGACAAAGACGCCCAACACCAAGCAAAGCTTGAGGGTACAAATGACGCTCGAACAGGCATGCCCTTTGGAATACCAAAGGGCGCAATGTGCGTTCAAAGATTCGATGATTCACTGAATTCTGCAATTCACACTACGTATCGCATTTCGCTGCGTTCTTCATCGATGCCAGAACCAAGAGATCCGTTGTTGAAAGTTGTAATAATTACATTGTTTACTGACGCTGATTGCAATTACAAAAAGGTTTATGGTTTGGTCCTGGTGGCGGGCGAACCCGCCCAGGAAACAAGAAGTGCGCAAAAGACATGGGTGAATAATTCAGACAAGCTGGAGCCCTCACCGAGGTGAGGTCCCAACCCGCTTTCATATTGTGTAATGATCCCTCCGCAGGTTCACCTACGGA,Stemphylium,Stemphylium_vesicarium,NR_111243.1 Stemphylium vesicarium CBS 191.86 ITS region; from synonym TYPE material,99.223,Stemphylium,Stemphylium_herbarum,k__Fungi;p__Ascomycota;c__Dothideomycetes;o__Pleosporales;f__Pleosporaceae;g__Stemphylium;s__Stemphylium_herbarum,491,100,Stemphylium_herbarum|DQ491516|SH387143.07FU|refs|k__Fungi;p__Ascomycota;c__Dothideomycetes;o__Pleosporales;f__Pleosporaceae;g__Stemphylium;s__Stemphylium_herbarum,515,Stemphylium_herbarum,Stemphylium,491,100,Ascomycota,Dothideomycetes,Pleosporales,Pleosporaceae
15,m,1,L,p,3,m1,m1L,m1Lp,m1Lp3,m1Lp3,,,,,,,,,,,,,,,,,,,,,,,,,,
16,m,1,L,p,4,m1,m1L,m1Lp,m1Lp4,m1Lp4,,,,,,,,,,,,,,,,,,,,,,,,,,
17,m,1,L,p,5,m1,m1L,m1Lp,m1Lp5,m1Lp5,,,,,,,,,,,,,,,,,,,,,,,,,,
18,m,1,L,p,6,m1,m1L,m1Lp,m1Lp6,m1Lp6,,,,,,,,,,,,,,,,,,,,,,,,,,
19,m,1,L,s,1,m1,m1L,m1Ls,m1Ls1,m1Ls1,,,,,,,,,,,,,,,,,,,,,,,,,,
20,m,1,L,s,2,m1,m1L,m1Ls,m1Ls2,m1Ls2,"bl, g",,,,"bl, vis, conc",,GGTCAAAAGTTGAAAAAGGCTTAATGGATGCTAGACCTTTGCTGATAGAGAGTGCGACTTGTGCTGCGCTCCGAAACCAGTAGGCCGGCTGCCAATTACTTTAAGGCGAGTCTCCAGCAAAGCTAGAGACAAGACGCCCAACACCAAGCAAAGCTTGAGGGTACAAATGACGCTCGAACAGGCATGCCCTTTGGAATACCAAAGGGCGCAATGTGCGTTCAAAGATTCGATGATTCACTGAATTCTGCAATTCACACTACTTATCGCATTTCGCTGCGTTCTTCATCGATGCCAGAACCAAGAGATCCGTTGTTGAAAGTTGTAATTATTAATTTGTTACTGACGCTGATTGCAATTACAAAAGGTTTATGTTTGTCCTAGTGGTGGGCGAACCCACCAAGGAAACAAGAAGTACGCAAAAGACAAGGTTGAATAATTCAGCAAGGCTGTAACCCCGAGAGGTTCCAGCCCGCCTTCATATTTGTGAAAAGATCCCTCCGCAGGTTCACCTGCGGA,Alternaria,Alternaria_alternata,NR_131316.1 Alternaria alternata CBS 916.96 ITS region; from verified material,98.842,Alternaria,Alternaria_alternata,k__Fungi;p__Ascomycota;c__Dothideomycetes;o__Pleosporales;f__Pleosporaceae;g__Alternaria;s__Alternaria_alternata,481,99.376,Alternaria_alternata|KF465761|SH429908.07FU|refs|k__Fungi;p__Ascomycota;c__Dothideomycetes;o__Pleosporales;f__Pleosporaceae;g__Alternaria;s__Alternaria_alternata,518,Alternaria_alternata,Alternaria,481,99.376,Ascomycota,Dothideomycetes,Pleosporales,Pleosporaceae
21,m,1,L,s,3,m1,m1L,m1Ls,m1Ls3,m1Ls3,,,,,,,,,,,,,,,,,,,,,,,,,,
22,m,1,L,s,4,m1,m1L,m1Ls,m1Ls4,m1Ls4,,,,,,,,,,,,,,,,,,,,,,,,,,
23,m,1,L,s,5,m1,m1L,m1Ls,m1Ls5,m1Ls5,"w, g",,sw fl,ia,,,AAATGTGGTCTTGATGGATGCTCAACCAAGGCTGATTCAAAGTGCAAGAATTGTGCTGCGCTCCGAAACCAGTAGGTCGGCTGCCAATCATTTTAAGGCGAGTCTCGTGAGAGACAAAGACGCCCAACACCAAGCAAAGCTTGAGGGTACAAATGACGCTCGAACAGGCATGCCCTTTGGAATACCAAAGGGCGCAATGTGCGTTCAAAGATTCGATGATTCACTGAATTCTGCAATTCACACTACGTATCGCATTTCGCTGCGTTCTTCATCGATGCCAGAACCAAGAGATCCGTTGTTGAAAGTT,Stemphylium,Stemphylium_vesicarium,NR_111243.1 Stemphylium vesicarium CBS 191.86 ITS region; from synonym TYPE material,99.674,Stemphylium,Stemphylium_herbarum,k__Fungi;p__Ascomycota;c__Dothideomycetes;o__Pleosporales;f__Pleosporaceae;g__Stemphylium;s__Stemphylium_herbarum,307,100,Stemphylium_herbarum|DQ491516|SH387143.07FU|refs|k__Fungi;p__Ascomycota;c__Dothideomycetes;o__Pleosporales;f__Pleosporaceae;g__Stemphylium;s__Stemphylium_herbarum,307,Stemphylium_herbarum,Stemphylium,307,100,Ascomycota,Dothideomycetes,Pleosporales,Pleosporaceae
24,m,1,L,s,6,m1,m1L,m1Ls,m1Ls6,m1Ls6,w,,"low, clockwise",,,"li b, li o",,,,,,,,,,,,,,,,,,,,
25,m,1,S,1,1,m1,m1S,m1S1,m1S11,m1S11,,,,,,,,,,,,,,,,,,,,,,,,,,
26,m,1,S,1,2,m1,m1S,m1S1,m1S12,m1S12,,,,,,,,,,,,,,,,,,,,,,,,,,
27,m,1,S,1,3,m1,m1S,m1S1,m1S13,m1S13,,,,,,,,,,,,,,,,,,,,,,,,,,
28,m,1,S,1,4,m1,m1S,m1S1,m1S14,m1S14,,,,,,,,,,,,,,,,,,,,,,,,,,
29,m,1,S,1,5,m1,m1S,m1S1,m1S15,m1S15,,,,,,,,,,,,,,,,,,,,,,,,,,
30,m,1,S,1,6,m1,m1S,m1S1,m1S16,m1S16,,,,,,,,,,,,,,,,,,,,,,,,,,
31,m,1,S,a,1,m1,m1S,m1Sa,m1Sa1,m1Sa1,,,,,,,,,,,,,,,,,,,,,,,,,,
32,m,1,S,a,2,m1,m1S,m1Sa,m1Sa2,m1Sa2,,,,,,,,,,,,,,,,,,,,,,,,,,
33,m,1,S,a,3,m1,m1S,m1Sa,m1Sa3,m1Sa3,,,,,,,,,,,,,,,,,,,,,,,,,,
34,m,1,S,a,4,m1,m1S,m1Sa,m1Sa4,m1Sa4,"w, g",,,ia,,,AAATGTGGTCTTGATGGATGCTCAACCAAGGCTGATTCAAAGTGCAAGAATTGTGCTGCGCTCCGAAACCAGTAGGTCGGCTGCCAATCATTTTAAGGCGAGTCTCGTGAGAGACAAAGACGCCCAACACCAAGCAAAGCTTGAGGGTACAAATGACGCTCGAACAGGCATGCCCTTTGGAATACCAAAGGGCGCAATGTGCGTTCAAAGATTCGATGATTCACTGAATTCTGCAATTCACACTACGTATCGCATTTCGCTGCGTTCTTCATCGATGCCAGAACCAAGAGATCCGTTGTTGAAAGTT,Stemphylium,Stemphylium_vesicarium,NR_111243.1 Stemphylium vesicarium CBS 191.86 ITS region; from synonym TYPE material,99.674,Stemphylium,Stemphylium_herbarum,k__Fungi;p__Ascomycota;c__Dothideomycetes;o__Pleosporales;f__Pleosporaceae;g__Stemphylium;s__Stemphylium_herbarum,307,100,Stemphylium_herbarum|DQ491516|SH387143.07FU|refs|k__Fungi;p__Ascomycota;c__Dothideomycetes;o__Pleosporales;f__Pleosporaceae;g__Stemphylium;s__Stemphylium_herbarum,307,Stemphylium_herbarum,Stemphylium,307,100,Ascomycota,Dothideomycetes,Pleosporales,Pleosporaceae
35,m,1,S,a,5,m1,m1S,m1Sa,m1Sa5,m1Sa5,,,,,,,,,,,,,,,,,,,,,,,,,,
36,m,1,S,a,6,m1,m1S,m1Sa,m1Sa6,m1Sa6,,,,,,,,,,,,,,,,,,,,,,,,,,
37,m,1,S,p,1,m1,m1S,m1Sp,m1Sp1,m1Sp1,"w, g",,,,,,GGTCAAAAGTTGAAAAAGGCTTAATGGATGCTAGACCTTTGCTGATAGAGAGTGCGACTTGTGCTGCGCTCCGAAACCAGTAGGCCGGCTGCCAATTACTTTAAGGCGAGTCTCCAGCAAAGCTAGAGACAAGACGCCCAACACCAAGCAAAGCTTGAGGGTACAAATGACGCTCGAACAGGCATGCCCTTTGGAATACCAAAGGGCGCAATGTGCGTTCAAAGATTCGATGATTCACTGAATTCTGCAATTCACACTACTTATCGCATTTCGCTGCGTTCTTCATCGATGCCAGAACCAAGAGATCCGTTGTTGAAAGTTGTAATTATTAATTTGTTACTGACGCTGATTGCAATTACAAAAGGTTTATGTTTGTCCTAGTGGTGGGCGAACCCACCAAGGAAACAAGAAGTACGCAAAAGACAAGGTTGAATAATTCAGCAAGGCTGTAACCCCGAGAGGTTCCAGCCCGCCTTCATATTTGTGAAAAGATCCCTCCGCAGGTTCACCTGCGGA,Alternaria,Alternaria_alternata,NR_131316.1 Alternaria alternata CBS 916.96 ITS region; from verified material,98.842,Alternaria,Alternaria_alternata,k__Fungi;p__Ascomycota;c__Dothideomycetes;o__Pleosporales;f__Pleosporaceae;g__Alternaria;s__Alternaria_alternata,481,99.376,Alternaria_alternata|KF465761|SH429908.07FU|refs|k__Fungi;p__Ascomycota;c__Dothideomycetes;o__Pleosporales;f__Pleosporaceae;g__Alternaria;s__Alternaria_alternata,518,Alternaria_alternata,Alternaria,481,99.376,Ascomycota,Dothideomycetes,Pleosporales,Pleosporaceae
38,m,1,S,p,2,m1,m1S,m1Sp,m1Sp2,m1Sp2,,,,,,,,,,,,,,,,,,,,,,,,,,
39,m,1,S,p,3,m1,m1S,m1Sp,m1Sp3,m1Sp3,,,,,,,,,,,,,,,,,,,,,,,,,,
40,m,1,S,p,4,m1,m1S,m1Sp,m1Sp4,m1Sp4,,,,,,,,,,,,,,,,,,,,,,,,,,
41,m,1,S,p,5,m1,m1S,m1Sp,m1Sp5,m1Sp5,,,,,,,,,,,,,,,,,,,,,,,,,,
42,m,1,S,p,6,m1,m1S,m1Sp,m1Sp6,m1Sp6,,,,,,,,,,,,,,,,,,,,,,,,,,
43,m,1,S,s,1,m1,m1S,m1Ss,m1Ss1,m1Ss1,,,,,,,,,,,,,,,,,,,,,,,,,,
44,m,1,S,s,2,m1,m1S,m1Ss,m1Ss2,m1Ss2,"g, w",,,,"bl, vis oe",,CAAAGTTGAAAAAGGCTTAATGGATGCTAGACCTTTGCTGATAGAGAGTGCGACTTGTGCTGCGCTCCGAAACCAGTAGGCCGGCTGCCAATTACTTTAAGGCGAGTCTCCAGCAAAGCTAGAGACAAGACGCCCAACACCAAGCAAAGCTTGAGGGTACAAATGACGCTCGAACAGGCATGCCCTTTGGAATACCAAAGGGCGCAATGTGCGTTCAAAGATTCGATGATTCACTGAATTCTGCAATTCACACTACTTATCGCATTTCGCTGCGTTCTTCATCGATGCCAGAACCAAGAGATCCGTTGTTGAAAGTTGTAATTATTAATTTGTTACTGACGCTGATTGCAATTACAAAAGGTTTATGTTTGTCCTAGTGGTGGGCGAACCCACCAAGGAAACAAGAAGTACGCAAAAGACA,Alternaria,Alternaria_arborescens,NR_135927.1 Alternaria arborescens CBS 102605 ITS region; from TYPE material,99.762,Alternaria,Alternaria_arborescens,k__Fungi;p__Ascomycota;c__Dothideomycetes;o__Pleosporales;f__Pleosporaceae;g__Alternaria;s__Alternaria_arborescens,419,99.761,Alternaria_arborescens|JQ818176|SH206474.07FU|reps|k__Fungi;p__Ascomycota;c__Dothideomycetes;o__Pleosporales;f__Pleosporaceae;g__Alternaria;s__Alternaria_arborescens,421,Alternaria_arborescens,Alternaria,419,99.761,Ascomycota,Dothideomycetes,Pleosporales,Pleosporaceae
45,m,1,S,s,3,m1,m1S,m1Ss,m1Ss3,m1Ss3,,,,,,,,,,,,,,,,,,,,,,,,,,
46,m,1,S,s,4,m1,m1S,m1Ss,m1Ss4,m1Ss4,,,,,,,,,,,,,,,,,,,,,,,,,,
47,m,1,S,s,5,m1,m1S,m1Ss,m1Ss5,m1Ss5,,,,,,,,,,,,,,,,,,,,,,,,,,
48,m,1,S,s,6,m1,m1S,m1Ss,m1Ss6,m1Ss6,,,,,,,,,,,,,,,,,,,,,,,,,,
49,m,1,R,1,1,m1,m1R,m1R1,m1R11,m1R11,,,,,,,,,,,,,,,,,,,,,,,,,,
50,m,1,R,1,2,m1,m1R,m1R1,m1R12,m1R12,,,,,,,,,,,,,,,,,,,,,,,,,,
51,m,1,R,1,3,m1,m1R,m1R1,m1R13,m1R13,,,,,"d, g","li b, li o",,,,,,,,,,,,,,,,,,,,
52,m,1,R,1,4,m1,m1R,m1R1,m1R14,m1R14,,,,,,,,,,,,,,,,,,,,,,,,,,
53,m,1,R,1,5,m1,m1R,m1R1,m1R15,m1R15,,,,,,,,,,,,,,,,,,,,,,,,,,
54,m,1,R,1,6,m1,m1R,m1R1,m1R16,m1R16,w,,superficial,,,,GGTCAACATTCAGAAGTTGGGGTTTTACGGCGTGGCCGCGACGATTACCAGTAACGAGGTGTATGATTACTACGCTATGGAAGCTCGACGTGACCGCCAATCGATTTGGGGAACGCGGGTTACCGCGAGTCCCAACACCAAGCTGAGCTTGAGGGTTGAAATGACGCTCGAACAGGCATGCCCGCCAGAATACTGGCGGG,Fusarium,Fusarium_equiseti,NR_121457.1 Fusarium equiseti NRRL 26419 ITS region; from TYPE material,99.5,unidentified,Nectriaceae_sp,k__Fungi;p__Ascomycota;c__Sordariomycetes;o__Hypocreales;f__Nectriaceae;g__unidentified;s__Nectriaceae_sp,200,100,Nectriaceae_sp|JN983446|SH220702.07FU|reps|k__Fungi;p__Ascomycota;c__Sordariomycetes;o__Hypocreales;f__Nectriaceae;g__unidentified;s__Nectriaceae_sp,200,Fusarium_equiseti,Fusarium,200,99.5,Ascomycota,Sordariomycetes,Hypocreales,Nectriaceae
55,m,1,R,a,1,m1,m1R,m1Ra,m1Ra1,m1Ra1,,,,,,,,,,,,,,,,,,,,,,,,,,
56,m,1,R,a,2,m1,m1R,m1Ra,m1Ra2,m1Ra2,,,,,,,,,,,,,,,,,,,,,,,,,,
57,m,1,R,a,3,m1,m1R,m1Ra,m1Ra3,m1Ra3,,,,,,,,,,,,,,,,,,,,,,,,,,
58,m,1,R,a,4,m1,m1R,m1Ra,m1Ra4,m1Ra4,w,,superficial,,,,GGTCAACATTCAGAAGTTGGGGTTTTACGGCGTGGCCGCGACGATTACCAGTAACGAGGTGTATGATTACTACGCTATGGAAGCTCGACGTGACCGCCAATCGATTTGGGGAACGCGGGTTACCGCGAGTCCCAACACCAAGCTGAGCTTGAGGGTTGAAATGACGCTCGAACAGGCATGCCCGCCAGAATACTGGCGGG,Fusarium,Fusarium_equiseti,NR_121457.1 Fusarium equiseti NRRL 26419 ITS region; from TYPE material,99.5,unidentified,Nectriaceae_sp,k__Fungi;p__Ascomycota;c__Sordariomycetes;o__Hypocreales;f__Nectriaceae;g__unidentified;s__Nectriaceae_sp,200,100,Nectriaceae_sp|JN983446|SH220702.07FU|reps|k__Fungi;p__Ascomycota;c__Sordariomycetes;o__Hypocreales;f__Nectriaceae;g__unidentified;s__Nectriaceae_sp,200,Fusarium_equiseti,Fusarium,200,99.5,Ascomycota,Sordariomycetes,Hypocreales,Nectriaceae
59,m,1,R,a,5,m1,m1R,m1Ra,m1Ra5,m1Ra5,,,,,,,,,,,,,,,,,,,,,,,,,,
60,m,1,R,a,6,m1,m1R,m1Ra,m1Ra6,m1Ra6,,,,,,,,,,,,,,,,,,,,,,,,,,
61,m,1,R,p,1,m1,m1R,m1Rp,m1Rp1,m1Rp1,,,,,,,,,,,,,,,,,,,,,,,,,,
62,m,1,R,p,2,m1,m1R,m1Rp,m1Rp2,m1Rp2,"w, puP",li pu,,,,,GGTCAACATTCAGAAGTTGGGGTTTAACGGCGTGGCCGCGACGATTACCAGTAACGAGGGTTTTACTACTACGCTATGGAAGCTCGACGTGACCGCCAATCAATTTGAGGAACGCGAATTAACGCGAGTCCCAACACCAAGCTGTGCTTGAGGGTTGAAATGACGCTCGAACAGGCATGCCCGCCAGAATACTGGCGGGCGCAATGTGCGTTCAAAGATTCGATGATTCACTGAATTCTGCAATTCACATTACTTATCGCATTTTGCTGCGTTCTTCATCGATGCCAGAACCAAGAGATCCGTTGTTGAAAGTTTTGATTTATTTATGGTTTTACTCAGAAGTTAC,Fusarium,Fusarium_circinatum,NR_120263.1 Fusarium circinatum CBS 405.97 ITS region; from TYPE material,98.563,unidentified,Ascomycota_sp,k__Fungi;p__Ascomycota;c__unidentified;o__unidentified;f__unidentified;g__unidentified;s__Ascomycota_sp,346,100,Ascomycota_sp|HF566400|SH195288.07FU|reps|k__Fungi;p__Ascomycota;c__unidentified;o__unidentified;f__unidentified;g__unidentified;s__Ascomycota_sp,348,Fusarium_circinatum,Fusarium,348,98.563,Ascomycota,Sordariomycetes,Hypocreales,Nectriaceae
63,m,1,R,p,3,m1,m1R,m1Rp,m1Rp3,m1Rp3,"w, puP",li pu,,,,,GGTCAACATTCAGAAGTTGGGGTTTAACGGCGTGGCCGCGACGATTACCAGTAACGAGGGTTTTACTACTACGCTATGGAAGCTCGACGTGACCGCCAATCAATTTGAGGAACGCGAATTAACGCGAGTCCCAACACCAAGCTGTGCTTGAGGGTTGAAATGACGCTCGAACAGGCATGCCCGCCAGAATACTGGCGGGCGCAATGTGCGTTCAAAGATTCGATGATTCACTGAATTCTGCAATTCACATTACTTATCGCATTTTGCTGCGTTCTTCATCGATGCCAGAACCAAGAGATCCGTTGTTGAAAGTTTTGATTTATTTATGGTTTTACTCAGAAGTTAC,Fusarium,Fusarium_circinatum,NR_120263.1 Fusarium circinatum CBS 405.97 ITS region; from TYPE material,98.563,unidentified,Ascomycota_sp,k__Fungi;p__Ascomycota;c__unidentified;o__unidentified;f__unidentified;g__unidentified;s__Ascomycota_sp,346,100,Ascomycota_sp|HF566400|SH195288.07FU|reps|k__Fungi;p__Ascomycota;c__unidentified;o__unidentified;f__unidentified;g__unidentified;s__Ascomycota_sp,348,Fusarium_circinatum,Fusarium,348,98.563,Ascomycota,Sordariomycetes,Hypocreales,Nectriaceae
64,m,1,R,p,4,m1,m1R,m1Rp,m1Rp4,m1Rp4,,,,,,,,,,,,,,,,,,,,,,,,,,
65,m,1,R,p,5,m1,m1R,m1Rp,m1Rp5,m1Rp5,,,,,,,,,,,,,,,,,,,,,,,,,,
66,m,1,R,p,6,m1,m1R,m1Rp,m1Rp6,m1Rp6,"w, b",,,,,li b,,,,,,,,,,,,,,,,,,,,
67,m,1,R,s,1,m1,m1R,m1Rs,m1Rs1,m1Rs1,,,,,,,,,,,,,,,,,,,,,,,,,,
68,m,1,R,s,2,m1,m1R,m1Rs,m1Rs2,m1Rs2,"w, yelP",yelP,mucor,,,,GTTTTATTTGGGAGGCCCCAGAGATAGTCTTAATACTAGAGCATTCCTTTATATTAAAAAAATGTTCAGGCAGAAAGAACAATAGTTCAGGCCTAATAGGTTTAAAGAATTCAAACAAGTCGAAATTCTCAGTTCCATTCACAATAAAATTATGAATGTGGGGTGTTTTTGATACTGAAACAGGCGTGCTCAATGGAATACCATTGAGCGCAAGTTGCGTTCAAAGACTCGATGATTCACTGAATATGCAATTCACACTAGTTATCGCACTTTGCTACGTTCTTCATCGATGCGAGAACCAAGAGATCCGTTGTTAAAAGTTGTTTTATAAGTTTTTTACGCTTATGTTACAATAATAATACTGAATTCTTTTGGTAAATAATTAATAGGATACCAGGTCTAAACCTGACTTCAGCTCGGTTAACATTCTAATAGTCTATCCCTATGACTAAAAGACATTCCTCAAACGCTGAAAATTAAAACAGTTCACAGTAAAAAAGAATGAACC,Mucor,Mucor_fusiformis,NR_111660.1 Mucor fusiformis CBS 336.68 ITS region; from TYPE material,92.621,Mucor,Mucor_hiemalis,k__Fungi;p__Zygomycota;c__Mucoromycotina_cls_Incertae_sedis;o__Mucorales;f__Mucoraceae;g__Mucor;s__Mucor_hiemalis,508,99.606,Mucor_hiemalis|DQ118992|SH187073.07FU|refs|k__Fungi;p__Zygomycota;c__Mucoromycotina_cls_Incertae_sedis;o__Mucorales;f__Mucoraceae;g__Mucor;s__Mucor_hiemalis,515,Mucor_hiemalis,Mucor,508,99.606,Zygomycota,Mucoromycotina_cls_Incertae_sedis,Mucorales,Mucoraceae
69,m,1,R,s,3,m1,m1R,m1Rs,m1Rs3,m1Rs3,,,,,,,,,,,,,,,,,,,,,,,,,,
70,m,1,R,s,4,m1,m1R,m1Rs,m1Rs4,m1Rs4,,,,,,,,,,,,,,,,,,,,,,,,,,
71,m,1,R,s,5,m1,m1R,m1Rs,m1Rs5,m1Rs5,"w, yelP",yelP,mucor,,,,GTTTTATTTGGGAGGCCCCAGAGATAGTCTTAATACTAGAGCATTCCTTTATATTAAAAAAATGTTCAGGCAGAAAGAACAATAGTTCAGGCCTAATAGGTTTAAAGAATTCAAACAAGTCGAAATTCTCAGTTCCATTCACAATAAAATTATGAATGTGGGGTGTTTTTGATACTGAAACAGGCGTGCTCAATGGAATACCATTGAGCGCAAGTTGCGTTCAAAGACTCGATGATTCACTGAATATGCAATTCACACTAGTTATCGCACTTTGCTACGTTCTTCATCGATGCGAGAACCAAGAGATCCGTTGTTAAAAGTTGTTTTATAAGTTTTTTACGCTTATGTTACAATAATAATACTGAATTCTTTTGGTAAATAATTAATAGGATACCAGGTCTAAACCTGACTTCAGCTCGGTTAACATTCTAATAGTCTATCCCTATGACTAAAAGACATTCCTCAAACGCTGAAAATTAAAACAGTTCACAGTAAAAAAGAATGAACC,Mucor,Mucor_fusiformis,NR_111660.1 Mucor fusiformis CBS 336.68 ITS region; from TYPE material,92.621,Mucor,Mucor_hiemalis,k__Fungi;p__Zygomycota;c__Mucoromycotina_cls_Incertae_sedis;o__Mucorales;f__Mucoraceae;g__Mucor;s__Mucor_hiemalis,508,99.606,Mucor_hiemalis|DQ118992|SH187073.07FU|refs|k__Fungi;p__Zygomycota;c__Mucoromycotina_cls_Incertae_sedis;o__Mucorales;f__Mucoraceae;g__Mucor;s__Mucor_hiemalis,515,Mucor_hiemalis,Mucor,508,99.606,Zygomycota,Mucoromycotina_cls_Incertae_sedis,Mucorales,Mucoraceae
72,m,1,R,s,6,m1,m1R,m1Rs,m1Rs6,m1Rs6,"w, puP",li pu,,,,,CATTCAGAAGTTGGGGTTTAACGGCGTGGCCGCGACGATTACCAGTAACGAGGGTTTTACTACTACGCTATGGAAGCTCGACGTGACCGCCAATCAATTTGAGGAACGCGAATTAACGCGAGTTCCAACACCAAGCTGTGCTTGAGGGTTGAAATGACGCTCGAACAGGCATGCCCGCCAGAATACTGGCGGGC,Fusarium,Fusarium_circinatum,NR_120263.1 Fusarium circinatum CBS 405.97 ITS region; from TYPE material,96.939,unidentified,Ascomycota_sp,k__Fungi;p__Ascomycota;c__unidentified;o__unidentified;f__unidentified;g__unidentified;s__Ascomycota_sp,194,99.485,Ascomycota_sp|HF566400|SH195288.07FU|reps|k__Fungi;p__Ascomycota;c__unidentified;o__unidentified;f__unidentified;g__unidentified;s__Ascomycota_sp,196,Fusarium_circinatum,Fusarium,196,96.939,Ascomycota,Sordariomycetes,Hypocreales,Nectriaceae
73,m,2,L,1,1,m2,m2L,m2L1,m2L11,m2L11,"w, g",,sw fl,ia,,,AGTTGAAAAAAATGTGGTCTTGATGGATGCTCAACCAAGGCTGATTCAAAGTGCAAGAATTGTGCTGCGCTCCGAAACCAGTAGGTCGGCTGCCAATCATTTTAAGGCGAGTCTCGTGAGAGACAAAGACGCCCAACACCAAGCAAAGCTTGAGGGTACAAATGACGCTCGAACAGGCATGCCCTTTGGAATACCAAAGGGCGCAATGTGCGTTCAAAGATTCGATGATTCACTGAATTCTGCAATTCACACTACGTATCGCATTTCGCTGCGTTCTTCATCGATGCCAGAACCAAGAGATCCGTTGTTGAAAGTTGTAATAATTACATTGTTTACTGACGCTGATTGCAATTACAAAAAGGTTTATGGTTTGGTCCTGGTGGCGGGCGAACCCGCCCAGGAAACAAGAAGTGCGCAAAAGACATGGGTGAATAATTCAGACAAGCTGGAGCCCTCACCGAGGTGAGGTCCCAACCCGCTTTCATATTGAGAAAAGATCCCTCCGCAGGTTCACCTACGGAACC,Stemphylium,Stemphylium_vesicarium,NR_111243.1 Stemphylium vesicarium CBS 191.86 ITS region; from synonym TYPE material,98.641,Stemphylium,Stemphylium_herbarum,k__Fungi;p__Ascomycota;c__Dothideomycetes;o__Pleosporales;f__Pleosporaceae;g__Stemphylium;s__Stemphylium_herbarum,489,100,Stemphylium_herbarum|DQ491516|SH387143.07FU|refs|k__Fungi;p__Ascomycota;c__Dothideomycetes;o__Pleosporales;f__Pleosporaceae;g__Stemphylium;s__Stemphylium_herbarum,515,Stemphylium_herbarum,Stemphylium,489,100,Ascomycota,Dothideomycetes,Pleosporales,Pleosporaceae
74,m,2,L,1,2,m2,m2L,m2L1,m2L12,m2L12,,,,,,,,,,,,,,,,,,,,,,,,,,
75,m,2,L,1,3,m2,m2L,m2L1,m2L13,m2L13,,,,,,,,,,,,,,,,,,,,,,,,,,