﻿PhysioID,TimePeriod,PatientID,Cluster,ClusterPeriod,IntPrePost,POMPrePos,POMCI,FA1_Date,FA1_sex,FA1_Age,FA1_TimeMnths,FA1_Ethnicity_Group,FA1_Ethnicity_Other,Ethnicity,FA1_B1_Physio_YesNo,FA1_B1_PhysioVisits,FA1_B1_PhysioTelephone,FA1_B1_Physio_homeVisits,PSFS_Count,FA1_PSFS1,FA1_PSFS2,FA_PSFS3,FA_PSFSA,FA1_Oreb_neck,FA1_Oreb_shoulder,FA1_Oreb_arm,FA1_Oreb_Uback,FA1_Oreb_Lback,FA1_Oreb_Leg,FA1_Oreb_aOther,FA1_Oreb_b,FA1_Oreb_1,FA1_Oreb_2,FA1_Oreb_3,FA1_Oreb_4,FA1_Oreb_5,FA1_Oreb_6,FA1_Oreb_7,FA1_Oreb_8,FA1_Oreb_9,FA1_Oreb_10,FA1_Oreb_11,FA1_Oreb_12,FA1_Oreb_13,FA1_Oreb_14,FA1_Oreb_15,FA1_Oreb_16,FA1_Oreb_17,FA1_Oreb_18,FA1_Oreb_19,FA1_Oreb_20,FA1_Oreb_21,FA1_Oreb_items,Missing_Oreb,OrebSumF,OrebMeanF,ImpOreb,TotalOreb,FA1_Oreb_Risk,FA1_PAM_1,FA1_PAM_2,FA1_PAM_3,FA1_PAM_4,FA1_PAM_5,FA1_PAM_6,FA1_PAM_7,FA1_PAM_8,FA1_PAM_9,FA1_PAM_10,FA1_PAM_11,FA1_PAM_12,FA1_PAM_13,FA_PAM_RAWSCORE,FA_PAM_ACTISCORE,PAM_LEVEL,FA1_EQ5D_1,FA1_EQ5D_2,FA1_EQ5D_3,FA1_EQ5D_4,FA1_EQ5D_5,FA1_EQ5D_VAS,FA1_EQ5DIndex,ExcsHx,ET1_B1_Physio_YesNo,ET1_B1_PhysioVisits,ET1_B1_PhysioClassVisits,ET1_B1_PhysioTelephone,ET1_B1_Physio_homeVisits,MRPSCI,ET1_MRPS1,ET1_MRPS2n,ET1_MRPS3,ET1_MRPS4n,ET1_MRPS5,ET1_MRPS6,ET1_MRPS7,ET1_MRPS8n,ET1_MRPS9,ET1_MRPS10,ET1_MRPS11,ET1_MRPS12,ET1_MRPS13,ETStatus,ET1_MRPSMEAN,ET1_MRPSMEAN1to3,ET1_MRPSMEAN4to12,ET_PSFS1,ET_PSFS2,ET_PSFS3,ET_PSFSA,ET_PSFSDIFF1,ET_PSFSDIFF2,ET_PSFSDIFF3,ET_PSFSADIFF,ET_SIG,PSFSdiffET,PSFSNew,PSFSNewB,PAMCI,ET1_PAM_1,ET1_PAM_2,ET1_PAM_3,ET1_PAM_4,ET1_PAM_5,ET1_PAM_6,ET1_PAM_7,ET1_PAM_8,ET1_PAM_9,ET1_PAM_10,ET1_PAM_11,ET1_PAM_12,ET1_PAM_13,ET1_PAM_RAWSCORE,ET1_PAM_ACTISCORE,ET1_PAM_LEVEL,PAM_CHANGE,PAMdiffET,EQ5DCI,ET1_EQ5D_1,ET1_EQ5D_2,ET1_EQ5D_3,ET1_EQ5D_4,ET1_EQ5D_5,ET1_EQ5DIndex,ET1_EQ5D_VAS,ET1_EQ5DIndexDIFF,ET1_EQ5DVASDIFF,FU1_Physio_YesNo,FU1_B1_PhysioVisits,FU1_B1_PhysioTelephone,FU1_B1_Physio_homeVisits,FU_MRPS1,FU_MRPS2n,FU_MRPS3,FU_MRPS4n,FU_MRPS5,FU_MRPS6,FU_MRPS7,FU_MRPS8n,FU_MRPS9,FU_MRPS10,FU_MRPS11,FU_MRPS12,FU_MRPS13,FUStatus,FU_MRPSMEAN,FU_MRPSMEAN1to3,FU_MRPSMEAN4to12,FU_PSFS1,FU_PSFS2,FU_PSFS3,FU_PSFSA,FU_PSFSDIFF1,FU_PSFSDIFF2,FU_PSFSDIFF3,FU_PSFSADIFF,FU_SIG,PSFSdiffFU,FU_PAM1,FU_PAM2,FU_PAM3,FU_PAM4,FU_PAM5,FU_PAM6,FU_PAM7,FU_PAM8,FU_PAM9,FU_PAM10,FU_PAM11,FU_PAM12,FU_PAM13,FU_PAM_RAWSCORE,FU_PAM_ACTISCORE,FU_PAM_LEVEL,PAM_CHANGE_FA,PAM_CHANGE_ET,PAMdiffFU,FU_EQ5D1,FU_EQ5D2,FU_EQ5D3,FU_EQ5D4,FU_EQ5D5,FU_EQ5DIndex,FU_EQ5DVAS,Total_Sum,Total_SumF,filter_$,medianagepre,sex1,ethnicity1,LOW,MEDIUM,HIGH,EXCS0,EXCS12,EXCS3,Physio_1,Physio_2,Physio_3,Physio_4,Physio_5,Physio_6,Physio_7,Physio_8,Physio_9,Physio_10,Physio_11,Physio_12,Physio_13,Physio_14,Physio_15,Physio_16,ClusterDummyVariable_1,ClusterDummyVariable_2,ClusterDummyVariable_3,TimeDummyVariable_1,TimeDummyVariable_2,TimeDummyVariable_3,TimeDummyVariable_4,recodegood,recodepoor,IntDummyVar
1,1,1,2,1,1,2,2,4/1/2013,2,54,8,1, ,1,0,0,0,0,2,7,6, ,6.5,0,0,1,0,0,0,0, ,2,1,8,6,6,8,6,5,7,7,5,0,4,7,10,3,3,0,2,3,2,21,0,95,4.52380952380952,0,95,1,4,3,4,999,3,3,4,3,2,2,2,2,2,36.8,49.9,2,1,2,2,3,2,70,.747,1,1,6,0,0,0,1,5,4,4,5,5,5,5,5,3,5,5,5,4,2,4.67,4.33,4.78,9,8, ,8.5,0,0, ,1,1,2,1,0,1,3,3,3,999,3,3,3,2,999,3,2,2,2,34,43.4,1,-1,-6.5,1,1,2,2,3,1,.823,70,.076,0,0,0,0,0,4,3,4,5,5,5,5,5,4,5,5,5,2,1,4.58,3.67,4.89,9,8, ,8.5,0,0, , ,0,2,3,4,3,3,3,3,3,3,4,4,3,3,3,42,66,3,1,2,16.1,3,2,2,2,2,.7,75,3,3,0,54,1,0,1,0,0,1,0,0,1,0,0,0,0,0,0,0,0,0,0,0,0,0,0,0,0,1,0,1,0,0,0,1,1,0
1,1,2,2,1,1,3,2,4/1/2013,1,73,6,1, ,1,0,0,0,0,3,2,0,0,.67,0,0,0,0,1,1,0, ,4,1,8,0,7,7,7,10,6,0,10,10,999,1,7,999,999,10,2,7,1,18,3,98,5.44444444444444,16.3333333333333,114.333333333333,2,999,3,3,3,3,2,3,2,999,2,2,2,3,33,41.7,1,4,1,3,4,3,40,.362,1,1,6,0, , ,0, , , , , , , , , , , , , , , , , ,5,0,0,1.67,1,0,0,0,0,1,0,0,0, , , , , , , , , , , , , , , , , , ,0, , , , , , , , , , , , , , , , , , , , , , , , , , , , , , ,10,0,0,3.33,1,0,0,1,1,2.66, , , , , , , , , , , , , , , , , , , , , , , , , , ,5,5,0,73,0,0,0,1,0,1,0,0,1,0,0,0,0,0,0,0,0,0,0,0,0,0,0,0,0,1,0,1,0,0,0,0,0,0
1,1,3,2,1,1,3,2,4/1/2013,2,55,6,11, ,2,1,4,0,0,1,4, , ,4,0,0,0,0,1,1,0, ,4,9,8,6,10,10,8,3,10,2,6,1,0,4,8,10,0,3,3,3,6,21,0,114,5.42857142857143,0,114,2,3,3,3,3,3,3,3,3,3,3,3,3,3,39,56.4,3,3,1,3,3,1,80,.802,3,1,6,10, , ,0, , , , , , , , , , , , , , , , , ,9,10, ,9.5,1,1, ,1,1,5.5,3,1,0, , , , , , , , , , , , , , , , , , ,0, , , , , , , , , , , , , , , , , , , , , , , , , , , , , , ,9,10, ,9.5,1,1, ,1,1,5.5, , , , , , , , , , , , , , , , , , , , , , , , , , ,13,13,0,55,1,1,0,1,0,0,0,1,1,0,0,0,0,0,0,0,0,0,0,0,0,0,0,0,0,1,0,1,0,0,0,1,1,0
1,1,5,2,1,1,2,2,4/1/2013,1,52,144,1, ,1,0,0,0,0,1,3, , ,3,0,0,0,0,0,1,0, ,2,2,10,4,2,5,8,7,7,7,3,999,8,9,8,7,0,1,1,1,3,20,1,95,4.75,4.75,99.75,1,4,4,4,4,3,3,4,3,3,3,2,2,2,41,63.2,3,1,1,1,3,3,70,.827,2,1,3,0, , ,1,4,4,999,5,4,4,4,4,4,4,4,4,2,1,4.09,4,4.11,8, , ,8,1, , , ,1,5,3,1,1,4,3,3,3,3,3,3,3,3,3,3,3,3,40,60,3,0,-3.2,1,1,1,1,2,3,.841,70,.014,0,0,0,0,0,4,4,999,5,4,4,4,4,4,4,4,4,2,1,4.09,4,4.11,8, , ,8,1, , , ,1,5,4,3,3,3,3,3,3,3,3,3,3,3,3,40,60,3,0,999,-3.2,1,1,1,2,3,.841,70,4,4,0,52,0,0,1,0,0,0,1,0,1,0,0,0,0,0,0,0,0,0,0,0,0,0,0,0,0,1,0,1,0,0,0,1,1,0
2,1,2,2,1,1,2,2,4/1/2013,2,45,6,1, ,1,0,0,0,0,1,6, , ,6,0,0,0,0,0,1,0, ,2,1,8,0,5,8,10,8,4,0,8,10,1,8,6,0,6,8,5,4,8,21,0,110,5.23809523809524,0,110,2,4,4,4,3,3,3,3,3,3,3,3,3,4,43,68.5,4,2,1,2,3,2,95,.752,3,1,9,0, , ,1,4,3,2,4,4,4,4,4,4,4,4,4,3,1,3.75,3,4,8, , ,8,0, , , ,0,2,1,0,1,4,4,4,4,3,3,3,3,3,3,3,3,3,43,68.5,4,0,0,1,2,1,2,2,2,.767,90,.015,-5,0,0,0,0,4,3,2,4,4,4,4,4,4,4,4,4,3,1,3.75,3,4,8, , ,8,0, , , ,0,2,4,4,4,4,3,3,3,3,3,3,3,3,3,43,68.5,4,0,999,0,2,1,2,2,2,.767,90,3,3,0,45,1,0,0,1,0,0,0,1,0,1,0,0,0,0,0,0,0,0,0,0,0,0,0,0,0,1,0,1,0,0,0,0,0,0
2,1,3,2,1,1,3,2,4/1/2013,1,51,18,1, ,1,0,0,0,0,3,5,8,6,6.33,0,0,0,0,0,1,0, ,2,999,10,999,6,7,6,4,4,3,7,999,999,3,6,4,7,8,5,5,3,17,4,90,5.29411764705882,21.1764705882353,111.176470588235,2,3,3,3,3,3,3,3,3,3,3,3,3,3,39,56.4,3,2,1,2,2,1,45,.843,3,1,3,0, , ,0, , , , , , , , , , , , , , , , , ,6,8,6,6.67,0,0,0,0,0,.34,0,0,0, , , , , , , , , , , , , , , , , , ,0, , , , , , , , , , , , , , , , , , , , , , , , , , , , , , ,10,10,10,10,1,0,1,1,1,3.67, , , , , , , , , , , , , , , , , , , , , , , , , , , , ,0,51,0,0,0,1,0,0,0,1,0,1,0,0,0,0,0,0,0,0,0,0,0,0,0,0,0,1,0,1,0,0,0,0,0,0
2,1,4,2,1,1,1,1,4/1/2013,2,24,17,1, ,1,1,3,0,0,3,4,4,7,5,1,1,1,0,0,0,0, ,6,5,10,2,5,5,9,10,3,1,10,0,2,2,10,3,5,0,6,5,3,21,0,102,4.85714285714286,0,102,1,3,4,3,3,3,3,4,2,2,3,2,2,3,37,49.9,2,1,2,3,3,2,80,.731,2,1,6,0, , ,0, , , , , , , , , , , , , , , , , , , , , , , , , ,999, , , ,0, , , , , , , , , , , , , , , , , , ,0, , , , , , , , , , , , , , , , , , , , , , , , , , , , , , , , , , , , , , ,999, , , , , , , , , , , , , , , , , , , , , , , , , , , ,11,11,0,24,1,0,1,0,0,0,1,0,0,1,0,0,0,0,0,0,0,0,0,0,0,0,0,0,0,1,0,1,0,0,0,1,0,0
2,1,5,2,1,1,2,2,4/1/2013,2,33,3,1, ,1,1,2,0,0,2,5,5, ,5,0,0,0,0,0,1,0, ,2,1,8,0,2,3,7,0,0,0,5,0,0,0,10,0,0,0,0,0,0,21,0,38,1.80952380952381,0,38,1,4,4,4,999,3,3,3,3,2,2,2,3,2,38,52.9,2,1,1,1,1,1,99,1,3,1,3,0, , ,1,5,5,5,5,5,5,5,5,5,5,5,5,1,1,5,5,5,7,8, ,7.5,0,1, ,1,1,2.5,2,0,1,4,4,4,999,4,4,4,4,4,4,4,4,4,52,100,4,2,47.1,1,2,1,1,2,1,.893,95,-.107,-4,0,0,0,0,5,5,5,5,5,5,5,5,5,5,5,5,1,1,5,5,5,7,8, ,7.5,0,1, ,1,1,2.5,4,4,4,999,4,4,4,4,4,4,4,4,4,52,100,4,2,999,47.1,2,1,1,2,1,.893,95,3,3,0,33,1,0,1,0,0,0,0,1,0,1,0,0,0,0,0,0,0,0,0,0,0,0,0,0,0,1,0,1,0,0,0,1,1,0
2,1,6,2,1,1,2,2,4/1/2013,2,75,120,1, ,1,1,2,0,0,3,5,4,7,5.33,0,0,0,0,1,0,0, ,2,1,10,2,3,2,3,3,2,2,7,0,2,3,8,0,0,5,4,1,3,21,0,63,3,0,63,1,3,2,3,3,3,4,3,3,2,3,2,2,3,36,47.4,2,2,1,2,2,1,80,.843,3,1,3,5, , ,1,4,4,4,4,4,4,4,4,4,4,5,4,5,2,4.08,4,4.11,5,6,5,5.33,0, , , ,0,0,0,0,1,3,3,3,2,3,3,3,3,2,3,2,2,3,35,45.2,1,-1,-2.2,1,3,1,3,2,1,.816,70,-.027,-10,0,0,0,0,4,4,4,4,4,4,4,4,4,4,5,4,5,2,4.08,4,4.11,5,6,5,5.33,0, , , ,0,0,3,3,3,2,3,3,3,3,2,3,2,2,3,35,45.2,1,-1,999,-2.2,3,1,3,2,1,.816,70,3,3,0,75,1,0,1,0,0,0,0,1,0,1,0,0,0,0,0,0,0,0,0,0,0,0,0,0,0,1,0,1,0,0,0,0,0,0
2,1,7,2,1,1,3,2,4/1/2013,2,74,48,1, ,1,0,0,0,0,1,2, , ,2,0,0,0,0,1,1,0, ,4,1,10,999,999,5,5,10,0,0,10,10,999,999,999,999,9,9,0,0,0,15,6,73,4.86666666666667,29.2,102.2,1,4,4,4,3,4,4,4,2,2,4,2,4,4,45,73.1,4,2,1,1,3,1,95,.878,1,1,6,0, , ,0, , , , , , , , , , , , , , , , , ,8, , ,8,1, , , ,1,6,3,1,0, , , , , , , , , , , , , , , , , , ,0, , , , , , , , , , , , , , , , , , , , , , , , , , , , , , ,10, , ,10,1, , , ,1,8, , , , , , , , , , , , , , , , , , , , , , , , , , ,5,5,0,74,1,0,1,0,0,1,0,0,0,1,0,0,0,0,0,0,0,0,0,0,0,0,0,0,0,1,0,1,0,0,0,1,1,0
2,1,13,2,1,1,3,2,4/1/2013,2,44,8,1, ,1,0,0,0,0,3,5,5,7,5.67,0,0,0,0,0,1,0, ,2,1,8,1,5,5,8,6,1,0,6,0,4,10,5,0,0,0,0,0,3,21,0,65,3.0952380952381,0,65,1,4,4,4,3,4,4,4,3,3,3,3,3,3,45,73.1,4,2,1,2,2,1,75,.843,3,1,4,0, , ,0, , , , , , , , , , , , , , , , , ,10,10,10,10,1,1,1,1,1,4.33,3,1,0, , , , , , , , , , , , , , , , , , ,0, , , , , , , , , , , , , , , , , , , , , , , , , , , , , , ,0,0,10,3.33,0,0,1,0,0,-2.34, , , , , , , , , , , , , , , , , , , , , , , , , , ,3,3,0,44,1,0,1,0,0,0,0,1,0,1,0,0,0,0,0,0,0,0,0,0,0,0,0,0,0,1,0,1,0,0,0,1,1,0
2,1,14,2,1,1,3,2,4/1/2013,2,58,36,1, ,1,0,1,0,0,1,2, , ,2,0,1,0,0,0,0,0, ,2,1,10,4,5,6,10,7,2,0,10,0,6,10,0,0,0,0,0,0,8,21,0,81,3.85714285714286,0,81,1,3,4,3,3,3,3,3,3,3,3,2,2,3,38,52.9,2,1,1,2,2,1,80,.893,2,1,6,0,0,0,1,5,999,4,5,5,5,5,5,5,5,5,5,1,1,4.91,4.5,5,9, , ,9,1, , , ,1,7,3,1,1,4,4,4,4,4,4,4,4,4,4,4,4,4,52,100,4,2,47.1,1,1,1,1,2,1,.942,85,.0489999999999999,5,0,0,0,0,4,999,4,4,4,4,4,999,4,4,4,4,2,1,4,4,4,9, , ,9,1, , , ,1,7,2,3,3,999,3,3,3,3,3,3,3,3,3,38,52.9,2,0,-2,0,1,1,1,1,1,1,95,3,3,0,58,1,0,1,0,0,0,1,0,0,1,0,0,0,0,0,0,0,0,0,0,0,0,0,0,0,1,0,1,0,0,0,1,1,0
3,1,2,3,2,1,3,2,4/1/2013,2,56,999,1, ,1,1,3,0,0,3,1,1,1,1,0,0,0,0,0,1,1,foot,4,999,6,999,8,7,10,9,6,6,9,999,999,10,10,10,10,10,10,10,10,17,4,145,8.52941176470588,34.1176470588235,179.117647058824,3,3,3,2,3,2,3,3,3,2,2,2,2,2,32,40.1,1,4,4,4,4,3,40,.084,999,1,6,0, , ,0, , , , , , , , , , , , , , , , , ,10,10,10,10,1,1,1,1,1,9,3,1,0, , , , , , , , , , , , , , , , , , ,0, , , , , , , , , , , , , , , , , , , , , , , , , , , , , , ,3,1,3,2.33,0,0,0,0,0,1.33, , , , , , , , , , , , , , , , , , , , , , , , , , ,4,4,0,56,1,0,0,0,1,0,0,0,0,0,1,0,0,0,0,0,0,0,0,0,0,0,0,0,0,0,1,1,0,0,0,1,1,0
3,1,7,3,2,1,3,2,4/1/2013,2,58,10,1, ,1,0,0,0,0,3,2,2,2,2,1,1,1,0,0,0,0, ,6,999,9,999,3,5,6,4,4,7,8,6,999,8,10,8,1,2,2,3,4,18,3,96,5.33333333333333,16,112,2,3,3,3,3,2,2,4,1,2,3,1,1,3,31,38.7,1,2,2,2,3,3,60,.673,1,1,2,0, , ,0, , , , , , , , , , , , , , , , , ,3,3, ,3,0,0, ,0,0,1,0,0,0, , , , , , , , , , , , , , , , , , ,0, , , , , , , , , , , , , , , , , , , , , , , , , , , , , , ,3,3, ,3,0,0, ,0,0,1, , , , , , , , , , , , , , , , , , , , , , , , , , ,6,6,0,58,1,0,0,1,0,1,0,0,0,0,1,0,0,0,0,0,0,0,0,0,0,0,0,0,0,0,1,1,0,0,0,0,0,0
3,1,8,3,2,1,2,2,4/1/2013,2,59,6,1, ,1,0,0,0,0,3,1,2,4,2.33,1,1,0,0,0,0,0, ,4,1,8,999,6,8,10,999,3,0,10,0,0,7,10,10,0,0,0,0,10,19,2,87,4.57894736842105,9.1578947368421,96.1578947368421,1,2,4,4,4,4,4,4,3,3,4,2,3,4,45,73.1,4,1,1,1,4,2,85,.657,2,1,6,0,0,0,1,5,1,4,5,5,5,5,1,5,5,5,5,2,1,4.25,3.33,4.55,8,9,9,8.66,1,1,1,1,1,6.33,3,1,1,4,4,4,4,4,4,4,4,4,4,3,3,3,49,82.8,4,0,9.7,1,1,1,1,2,1,.942,80,.285,-5, , , , ,5,1,4,5,5,5,5,1,5,5,5,5,2, ,4.25,3.33,4.55,8,9,9,8.66,1,1,1,1,1,6.33,4,4,4,4,4,4,4,4,4,4,3,3,3,49,82.8,4,0, ,9.7,1,1,1,2,1,.942,80,5,5,0,59,1,0,1,0,0,0,1,0,0,0,1,0,0,0,0,0,0,0,0,0,0,0,0,0,0,0,1,1,0,0,0,1,1,0
3,1,10,3,2,1,2,2,4/1/2013,1,76,6,1, ,1,1,1,0,0,3,4,4,6,4.66,1,1,0,0,0,0,0, ,4,1,7,3,5,6,7,4,1,1,5,3,3,6,10,6,0,2,2,1,8,21,0,85,4.04761904761905,0,85,1,3,4,4,3,4,4,4,4,3,3,3,3,3,45,73.1,4,2,2,2,2,1,80,.788,3,1,3,0,0,0,1,5,5,5,5,5,5,5,5,5,5,5,5,1,1,5,5,5,9,7,7,7.66,1,1,0,1,1,3,3,1,1,4,4,4,4,4,4,4,4,4,4,4,4,4,52,100,4,0,26.9,1,1,2,1,2,1,.887,95,.099,15, , , , ,5,5,5,5,5,5,5,5,5,5,5,5,1, ,5,5,5,9,7,7,7.66,1,1,0,1,1,3,4,4,4,4,4,4,4,4,4,4,4,4,4,52,100,4,0, ,26.9,1,2,1,2,1,.887,95,5,5,0,76,0,0,1,0,0,0,0,1,0,0,1,0,0,0,0,0,0,0,0,0,0,0,0,0,0,0,1,1,0,0,0,1,1,0
3,1,13,3,2,1,2,2,4/1/2013,1,26,14,11, ,2,0,0,0,0,3,5,2,2,3,0,0,0,0,0,1,0, ,2,2,9,8,5,4,4,8,1,0,7,0,8,3,1,1,0,0,0,0,0,21,0,63,3,0,63,1,4,4,4,4,4,4,3,4,3,4,4,4,4,50,86.3,4,2,1,2,3,1,90,.829,999,1,5,0,0,0,1,5,5,5,5,5,5,5,5,5,5,5,5,2,1,5,5,5,8,9,9,8.66,1,1,1,1,1,5.66,3,1,1,4,4,4,4,3,4,4,4,4,4,4,4,4,51,91.6,4,0,5.3,1,2,1,2,2,1,.843,80,.014,-10, , , , ,5,5,5,5,5,5,5,5,5,5,5,5,2, ,5,5,5,8,9,9,8.66,1,1,1,1,1,5.66,4,4,4,4,3,4,4,4,4,4,4,4,4,51,91.6,4,0, ,5.3,2,1,2,2,1,.843,80,4,4,0,26,0,1,1,0,0,0,0,0,0,0,1,0,0,0,0,0,0,0,0,0,0,0,0,0,0,0,1,1,0,0,0,1,1,0
3,1,14,3,2,1,2,2,4/1/2013,1,68,24,1, ,1,0,0,0,0,3,2,5,4,3.67,1,0,0,0,1,0,0, ,4,999,8,999,4,7,8,6,1,0,8,999,999,8,4,999,4,7,2,3,7,16,5,81,5.0625,25.3125,106.3125,2,3,3,3,2,3,3,3,3,2,3,2,2,3,35,45.2,1,3,1,3,3,1,40,.802,3,1,6,0, , ,1,5,999,4,5,5,5,5,5,5,5,5,5,3,1,4.91,4.5,5,4,5,4,4.67,0,0,0,0,0,1,0,0,1,4,4,4,3,4,4,4,4,4,4,3,4,4,50,86.3,4,3,41.1,1,2,1,2,2,1,.843,60,.0409999999999999,20, , , , ,5,999,4,5,5,5,5,5,5,5,5,5,3, ,4.91,4.5,5,4,5,4,4.67,0,0,0,0,0,1,4,4,4,3,4,4,4,4,4,4,3,4,4,50,86.3,4,3, ,41.1,2,1,2,2,1,.843,60,4,4,0,68,0,0,0,1,0,0,0,1,0,0,1,0,0,0,0,0,0,0,0,0,0,0,0,0,0,0,1,1,0,0,0,0,0,0
3,1,15,3,2,1,2,2,4/1/2013,2,37,24,1, ,1,1,3,0,0,3,2,2,3,2.33,1,1,0,1,0,0,0, ,6,1,7,5,2,4,3,3,2,2,5,999,999,5,8,2,1,1,2,4,4,19,2,67,3.52631578947368,7.05263157894737,74.0526315789474,1,4,4,4,2,3,2,3,3,2,3,3,2,3,38,52.9,2,1,1,2,2,1,75,.893,999,1,4,0,0,0,1,4,4,4,4,5,5,5,5,5,5,5,5,2,1,4.67,4,4.89,7,8,7,7.33,1,1,1,1,1,5,3,1,1,4,4,3,999,3,3,4,4,3,3,4,4,3,45,73.1,4,2,20.2,1,1,1,2,2,1,.893,87,0,12, , , , ,4,4,4,4,5,5,5,5,5,5,5,5,2, ,4.67,4,4.89,7,8,7,7.33,1,1,1,1,1,5,4,4,3,999,3,3,4,4,3,3,4,4,3,45,73.1,4,2, ,20.2,1,1,2,2,1,.893,87,7,7,0,37,1,0,1,0,0,0,0,0,0,0,1,0,0,0,0,0,0,0,0,0,0,0,0,0,0,0,1,1,0,0,0,1,1,0
4,1,1,2,1,1,3,2,4/1/2013,2,24,11,1, ,1,1,1,0,0,3,4,5,3,4,0,1,0,0,0,0,0, ,2,3,9,6,4,5,4,3,7,2,3,0,4,7,6,1,0,0,2,2,2,21,0,72,3.42857142857143,0,72,1,3,4,4,4,4,4,4,4,4,4,3,3,3,49,82.8,4,1,1,2,2,2,90,.816,1,1,8,0,0,0,1,4,4,2,4,4,5,5,4,5,5,2,4,3,1,4,3.33,4.22,9,8,8,8.33,1,1,1,1,1,4.33,3,1,1,3,3,3,999,3,3,3,3,2,2,3,2,2,35,45.2,1,-3,-37.6,1,1,1,2,2,1,.893,80,.0770000000000001,-10,0,0,0,0,4,5,4,4,4,5,5,5,4,5,3,4,5,2,4.33,4.33,4.33,9,8,3,6.67,1,1,0,1,1,2.67,4,3,3,999,4,4,4,4,4,4,3,3,3,46.6,77.5,4,0,3,-5.3,1,1,1,2,1,.942,80,5,5,0,24,1,0,1,0,0,1,0,0,0,0,0,1,0,0,0,0,0,0,0,0,0,0,0,0,0,1,0,1,0,0,0,1,1,0
4,1,3,2,1,1,3,2,4/1/2013,2,54,60,1, ,1,0,0,0,0,3,3,3,5,3.67,1,1,0,0,0,0,0, ,4,5,10,3,5,5,9,4,7,0,10,0,3,8,10,0,2,0,6,4,8,21,0,103,4.90476190476191,0,103,1,3,3,3,4,4,4,4,4,4,4,3,3,3,46,75.3,4,1,1,2,3,2,58,.802,1,1,7,0, , ,1,4,5,3,5,5,5,5,5,5,5,5,5,2,1,4.75,4,5,7,7,5,6.33,1,1,0,1,1,2.66,2,0,1,4,3,3,4,4,4,4,4,4,4,3,3,3,47,77.5,4,0,2.2,1,1,1,1,2,1,.942,80,.14,22,0,0,0,0,4,5,3,5,1,1,1,5,5,5,5,5,3,1,3.75,4,3.67,3,3,4,3.67,0,0,0,0,0,0,3,3,3,4,4,4,4,4,4,3,3,3,3,45, ,4,0,0, ,1,1,2,2,2,.816,60,9,9,0,54,1,0,1,0,0,1,0,0,0,0,0,1,0,0,0,0,0,0,0,0,0,0,0,0,0,1,0,1,0,0,0,1,1,0
4,1,5,2,1,1,1,1,4/1/2013,1,42,1,1, ,1,0,0,0,0,3,7,9,9,5.33,0,1,0,0,0,0,0, ,2,3,5,2,3,5,10,10,2,0,0,0,0,10,7,0,7,0,5,3,7,21,0,81,3.85714285714286,0,81,1,4,4,4,999,4,4,4,4,3,4,2,2,3,45,73.1,4,1,2,2,3,1,90,.823,3,1,5,0, , ,0, , , , , , , , , , , , , , , , , , , , , , , , , ,999, , , ,0, , , , , , , , , , , , , , , , , , ,0, , , , , , , , , , , , , , , , , , , , , , , , , , , , , , , , , , , , , , ,999, , , , , , , , , , , , , , , , , , , , , , , , , , , ,5,5,0,42,0,0,1,0,0,0,0,1,0,0,0,1,0,0,0,0,0,0,0,0,0,0,0,0,0,1,0,1,0,0,0,1,0,0
4,1,7,2,1,1,3,2,4/1/2013,1,44,10,1, ,1,1,1,0,0,3,5,5,5,5,0,0,0,0,0,0,1,foot,2,1,9,3,7,6,4,10,6,0,10,0,2,9,6,0,0,5,1,1,1,21,0,83,3.95238095238095,0,83,1,3,3,3,3,3,3,3,3,3,3,3,3,3,39,56.4,3,2,1,3,3,1,48,.813,3,1,4,0,0,0,1,5,4,4,4,5,5,5,5,5,5,5,5,5,2,4.75,4.33,4.89,7,7,7,7,0,0,0,1,1,2,1,0,1,3,3,3,3,3,3,3,3,3,3,3,3,3,39,56.4,3,0,0,1,2,1,2,2,1,.843,85,.03,37,0,0,0,0,4,4,4,4,4,4,4,4,4,4,4,4,5,2,4,4,4,5,5,5,5,0,0,0,0,0,0,3,3,3,3,3,3,3,3,3,3,3,3,3,39,56.4,3,0,0,0,2,1,1,2,1,.893,75,3,3,0,44,0,0,1,0,0,0,0,1,0,0,0,1,0,0,0,0,0,0,0,0,0,0,0,0,0,1,0,1,0,0,0,1,1,0
4,1,8,2,1,1,2,2,4/1/2013,1,34,12,1, ,1,0,0,0,0,3,5,5,5,5,0,0,1,0,0,0,0, ,2,1,9,0,2,3,9,8,6,7,10,0,3,10,5,0,0,0,0,2,0,21,0,77,3.66666666666667,0,77,1,4,4,4,999,4,3,4,3,2,2,2,2,3,40,60,3,1,1,1,2,3,60,.841,2,1,8,0,0,0,1,4,4,4,4,4,4,4,5,4,5,5,5,4,2,4.33,4,4.44,5,7,7,6.33,0,0,0,0,0,1.33,1,0,1,4,4,3,3,3,3,3,3,3,3,3,3,3,41,63.2,3,0,3.2,1,1,1,2,2,2,.816,60,-.025,0, , , , ,4,4,4,4,4,4,4,5,4,5,5,5,4, ,4.33,4,4.44,5,7,7,6.33,0,0,0,0,0,1.33,4,4,3,3,3,3,3,3,3,3,3,3,3,41,63.2,3,0, ,3.2,1,1,2,2,2,.816,60,3,3,0,34,0,0,1,0,0,0,1,0,0,0,0,1,0,0,0,0,0,0,0,0,0,0,0,0,0,1,0,1,0,0,0,0,0,0
4,1,9,2,1,1,3,2,4/1/2013,1,49,10,1, ,1,1,2,0,0,1,0, , ,0,0,1,0,1,0,0,0, ,4,4,9,4,9,8,8,6,7,8,9,1,1,7,5,6,4,0,2,2,5,21,0,109,5.19047619047619,0,109,2,3,3,4,4,4,4,4,3,4,3,3,3,3,45,73.1,4,1,3,3,4,2,20,.518,1,1,3,4,0,0,1,4,5,4,5,5,5,5,5,5,5,5,5,1,1,4.83,4.33,5,9, , ,9,1, , , ,1,9,3,1,1,3,3,4,4,4,4,4,4,4,3,3,3,3,46,75.3,4,0,2.2,1,1,1,2,2,1,.893,90,.375,70,0,0,0,0,5,5,4,5,5,5,5,5,5,5,5,5,5,2,4.92,4.67,5,3, , ,3,1, , , ,1,3,2,4,3,4,4,4,4,2,3,3,3,3,3,42,66,3,-1,-1,-7.09999999999999,1,1,3,3,3,.762,80,8,8,0,49,0,0,0,1,0,1,0,0,0,0,0,1,0,0,0,0,0,0,0,0,0,0,0,0,0,1,0,1,0,0,0,1,1,0
4,1,10,2,1,1,2,2,4/1/2013,1,29,5,1, ,1,0,0,0,0,3,6,2,3,3.67,0,0,0,0,1,0,0, ,2,1,7,2,4,4,7,8,3,3,4,0,2,10,10,0,0,0,0,3,3,21,0,73,3.47619047619048,0,73,1,4,4,4,4,4,4,4,3,3,2,2,2,2,42,66,3,2,1,2,2,2,65,.767,2,1,5,0,0,0,1,5,4,4,4,5,5,5,4,4,5,5,5,1,1,4.58,4.33,4.67,8,6,7,7,0,1,1,1,1,3.33,3,1,1,4,4,3,3,4,4,3,3,3,3,3,3,3,43,68.5,4,1,2.5,1,1,1,1,2,1,.942,90,.175,25,0,0,0,0,4,4,4,4,4,4,4,4,4,4,4,4,2,1,4,4,4,8,6,7,7,0,1,1,1,1,3.33,3,4,3,4,3,3,3,3,2,3,3,3,3,40,60,3,0,-3,-6,1,1,2,2,1,.893,78,3,3,0,29,0,0,1,0,0,0,1,0,0,0,0,1,0,0,0,0,0,0,0,0,0,0,0,0,0,1,0,1,0,0,0,1,1,0
4,1,11,2,1,1,2,2,4/1/2013,2,67,540,11, ,2,0,0,0,0,2,5,7, ,6,0,0,0,0,0,1,0, ,2,999,9,999,999,6,8,4,6,5,10,999,999,6,5,4,0,0,0,4,0,16,5,69,4.3125,21.5625,90.5625,1,4,4,3,3,4,4,4,4,4,3,4,4,4,49,82.8,4,3,1,3,3,3,80,.701,2,1,2,0,0,0,1,4,5,5,4,5,5,5,5,5,5,5,5,2,1,4.83,4.66,4.89,9,9, ,9,1,0, ,1,1,3,3,1,1,4,4,4,4,4,4,4,4,4,4,4,4,4,52,100,4,0,17.2,1,1,1,1,2,1,.942,95,.241,15, , , , ,4,5,5,4,5,5,5,5,5,5,5,5,2, ,4.83,4.66,4.89,9,9, ,9,1,0, ,1,1,3,4,4,4,4,4,4,4,4,4,4,4,4,4,52,100,4,0, ,17.2,1,1,1,2,1,.942,95,2,2,0,67,1,1,1,0,0,0,1,0,0,0,0,1,0,0,0,0,0,0,0,0,0,0,0,0,0,1,0,1,0,0,0,1,1,0
4,1,12,2,1,1,2,2,4/1/2013,2,65,17,1, ,1,1,1,0,0,3,3,3,3,3,1,1,1,1,0,0,0, ,8,999,10,999,6,8,10,4,0,0,9,999,999,10,10,10,7,3,7,7,7,17,4,116,6.82352941176471,27.2941176470588,143.294117647059,3,4,4,4,4,4,4,4,4,4,4,4,4,4,52,100,4,1,2,2,3,1,50,.823,3,1,16,0,0,0,1,4,4,4,5,5,5,5,5,4,5,5,5,1,1,4.67,4,4.89,9,9,9,9,1,1,1,1,1,6,3,1,1,4,4,4,4,4,4,4,4,4,4,4,4,4,52,100,4,0,0,1,1,1,1,2,1,.942,98,.119,48, , , , ,4,4,4,5,5,5,5,5,4,5,5,5,1, ,4.67,4,4.89,9,9,9,9,1,1,1,1,1,6,4,4,4,4,4,4,4,4,4,4,4,4,4,52,100,4,0, ,0,1,1,1,2,1,.942,98,8,8,0,65,1,0,0,0,1,0,0,1,0,0,0,1,0,0,0,0,0,0,0,0,0,0,0,0,0,1,0,1,0,0,0,1,1,0
4,1,14,2,1,1,2,2,4/1/2013,2,57,24,1, ,1,0,0,0,0,2,4,5, ,4.5,1,1,0,0,0,0,0, ,4,999,10,999,5,5,5,999,999,0,10,999,999,999,999,999,5,5,5,5,5,12,9,64,5.33333333333333,48,112,2,3,4,3,4,4,4,4,999,999,3,999,999,4,48,80,4,2,1,2,3,1,85,.829,1,1,6,0,0,0,1,5,5,4,1,5,5,5,5,5,5,5,5,3,1,4.58,4.67,4.55,6,7, ,6.5,0,0, ,1,1,2,1,0,1,4,4,4,4,4,4,4,4,4,4,4,4,4,52,100,4,0,20,1,1,1,2,3,1,.878,90,.049,5, , , , ,5,5,4,1,5,5,5,5,5,5,5,5,3, ,4.58,4.67,4.55,6,7, ,6.5,0,0, ,1,1,2,4,4,4,4,4,4,4,4,4,4,4,4,4,52,100,4,0, ,20,1,1,2,3,1,.878,90,4,4,0,57,1,0,0,1,0,1,0,0,0,0,0,1,0,0,0,0,0,0,0,0,0,0,0,0,0,1,0,1,0,0,0,1,1,0
5,1,1,1,3,1,2,2,4/1/2013,2,72,24,1, ,1,1,1,0,0,1,3, , ,3,0,0,0,0,1,0,0, ,2,999,10,999,6,7,10,10,7,0,0,0,999,0,10,0,10,10,10,0,0,18,3,92,5.11111111111111,15.3333333333333,107.333333333333,2,4,4,4,3,4,3,3,3,3,3,3,3,3,43,68.5,4,1,1,1,2,2,80,.866,3,1,4,0,0,0,1,4,5,4,5,4,4,4,5,5,4,4,5,4,2,4.42,4.33,4.44,7, , ,7,1, , , ,1,4,3,1,1,4,3,3,3,3,3,3,3,3,3,3,3,3,40,60,3,-1,-8.5,1,2,1,2,2,2,.767,80,-.099,0,0,0,0,0,3,3,4,999,4,4,3,3,3,2,2,2,5,2,3,3.33,2.875,7, , ,7,1, , , ,1,4,3,3,3,3,3,3,3,3,3,3,3,3,3,39,56.4,3,-1,0,-12.1,3,1,2,3,1,.817,20,2,2,0,72,1,0,0,1,0,0,0,1,0,0,0,0,1,0,0,0,0,0,0,0,0,0,0,0,1,0,0,1,0,0,0,1,1,0
5,1,2,1,3,1,3,2,4/1/2013,2,50,11,1, ,1,0,0,0,0,3,4,3,4,3.67,0,0,0,0,1,0,1,front hip,4,1,8,2,4,7,10,5,3,3,8,2,4,3,5,2,7,9,7,7,8,21,0,109,5.19047619047619,0,109,2,4,3,3,4,4,4,3,3,3,2,2,2,2,39,56.4,3,3,2,3,3,2,50,.67,2,1,5,0,0,0,1,4,999,4,5,5,5,5,5,5,5,5,5,1,1,4.82,4,5,9,9,6,8,1,1,0,1,1,4.33,3,1,1,3,3,4,4,3,3,3,3,3,3,3,2,3,40,60,3,0,3.6,1,1,1,1,2,1,.942,95,.272,45,0,0,0,0,3,4,3,5,5,5,5,5,5,5,5,5,2,1,4.58,3.33,5,8,8,7,7.67,1,1,1,1,1,4,3,3,3,3,3,3,3,3,3,3,3,3,3,39,56.4,3,0,0,0,2,1,2,2,1,.843,80,5,5,0,50,1,0,0,1,0,0,1,0,0,0,0,0,1,0,0,0,0,0,0,0,0,0,0,0,1,0,0,1,0,0,0,1,1,0
5,1,3,1,3,1,3,2,4/1/2013,2,47,3,1, ,1,0,0,0,0,3,2,5,6,4.33,0,0,0,0,0,0,1,elbow,2,1,7,3,5,8,9,3,3,0,5,0,2,8,10,0,4,0,4,6,2,21,0,82,3.9047619047619,0,82,1,3,3,3,3,4,3,4,4,2,3,2,2,2,38,52.9,2,1,1,3,3,1,80,.863,1,1,5,0,0,0,1,4,4,4,4,5,5,5,5,4,5,5,5,4,2,4.58,4,4.78,2,6,7,5,0,0,0,0,0,.67,0,0,1,3,4,4,3,4,4,4,3,4,3,3,3,3,45,73.1,4,2,20.2,1,1,1,3,3,1,.863,80,0,0,0,0,0,0,4,5,4,5,5,5,5,5,5,5,5,5,3,1,4.83,4.33,5,9,8,8,8.33,1,1,0,1,1,4,4,4,4,4,4,3,3,3,3,3,3,3,3,44,70.8,4,2,2,17.9,1,1,2,3,1,.878,85,3,3,0,47,1,0,1,0,0,1,0,0,0,0,0,0,1,0,0,0,0,0,0,0,0,0,0,0,1,0,0,1,0,0,0,0,0,0
5,1,4,1,3,1,2,2,4/1/2013,1,56,240,1, ,1,1,1,0,0,3,1,5,3,3,0,0,0,0,1,1,0, ,4,5,3,10,9,6,10,4,7,5,6,0,4,10,10,10,5,9,0,10,10,21,0,137,6.52380952380952,0,137,3,4,4,3,3,4,4,4,4,4,4,3,3,3,47,77.5,4,3,2,3,3,1,75,.747,2,1,5,0,0,0,1,4,4,5,5,5,5,5,5,5,5,5,5,1,1,4.83,4.33,5,8,10,4,7.33,1,1,0,1,1,4.33,3,1,1,4,4,4,4,4,4,4,4,4,4,4,4,4,52,100,4,0,22.5,1,1,1,2,2,1,.893,85,.146,10, , , , ,4,4,5,5,5,5,5,5,5,5,5,5,1, ,4.83,4.33,5,8,10,4,7.33,1,1,0,1,1,4.33,4,4,4,4,4,4,4,4,4,4,4,4,4,52,100,4,0, ,22.5,1,1,2,2,1,.893,85,9,9,0,56,0,0,0,0,1,0,1,0,0,0,0,0,1,0,0,0,0,0,0,0,0,0,0,0,1,0,0,1,0,0,0,1,1,0
5,1,5,1,3,1,3,2,4/1/2013,1,45,8,1, ,1,0,0,0,0,3,7,6,6,6.33,0,1,0,0,0,0,0, ,2,1,8,9,2,6,6,1,6,3,2,0,1,8,5,1,3,0,2,0,3,21,0,69,3.28571428571429,0,69,1,4,4,3,4,4,3,3,3,3,4,3,4,3,45,73.1,4,1,1,1,2,1,80,.942,1,1,3,0,0,0,1,5,4,4,4,5,5,5,5,3,5,5,5,2,1,4.58,4.33,4.67,9,9,8,8.67,0,1,0,1,1,2.34,2,0,1,4,4,4,3,3,4,4,3,3,3,3,3,3,44,70.8,4,0,-2.3,1,1,2,1,2,1,.887,90,-.0549999999999999,10,0,0,0,0,5,5,5,5,5,5,5,5,5,5,5,5,1,1,5,5,5,9,9,9,9,0,1,1,1,1,2.67,4,4,4,999,4,4,4,4,4,4,4,4,4,52,100,4,0,0,26.9,1,1,1,2,1,.942,95,3,3,0,45,0,0,1,0,0,1,0,0,0,0,0,0,1,0,0,0,0,0,0,0,0,0,0,0,1,0,0,1,0,0,0,1,1,0
5,1,6,1,3,1,2,2,4/1/2013,1,56,48,1, ,1,0,0,0,0,2,7,7, ,7,0,0,0,0,1,0,0, ,2,1,10,8,8,8,9,9,7,1,10,0,3,0,0,0,0,1,0,0,2,21,0,79,3.76190476190476,0,79,1,4,4,4,4,4,4,4,3,3,3,2,2,3,44,70.8,4,1,1,2,3,1,100,.878,3,1,3,0,0,0,1,5,5,5,5,5,5,5,5,5,5,5,5,1,1,5,5,5,8,9, ,8.5,0,0, ,0,1,1.5,1,0,1,4,4,4,4,4,4,4,4,4,4,4,4,4,52,100,4,0,29.2,1,1,1,1,2,1,.942,100,.0639999999999999,0, , , , ,5,5,5,5,5,5,5,5,5,5,5,5,1, ,5,5,5,8,9, ,8.5,0,0, ,0,1,1.5,4,4,4,4,4,4,4,4,4,4,4,4,4,52,100,4,0, ,29.2,1,1,1,2,1,.942,100,3,3,0,56,0,0,1,0,0,0,0,1,0,0,0,0,1,0,0,0,0,0,0,0,0,0,0,0,1,0,0,1,0,0,0,1,1,0
5,1,7,1,3,1,2,2,4/1/2013,2,45,240,1, ,1,0,0,0,0,2,1,2, ,1.5,1,1,0,0,1,0,0, ,6,1,10,6,4,5,5,0,2,0,6,0,0,7,10,0,0,0,0,0,0,21,0,62,2.95238095238095,0,62,1,3,4,4,3,999,3,4,4,2,3,3,3,3,42,66,3,1,1,1,2,1,95,.942,999,1,4,0,0,0,1,4,5,5,1,5,5,5,1,5,5,5,5,2,1,4.25,4.67,4.11,10,10, ,10,1,1, ,1,1,8.5,3,1,1,4,4,4,4,4,4,4,4,4,4,4,4,4,52,100,4,1,34,1,1,1,1,2,1,.942,100,0,5, , , , ,4,5,5,1,5,5,5,1,5,5,5,5,2, ,4.25,4.67,4.11,10,10, ,10,1,1, ,1,1,8.5,4,4,4,4,4,4,4,4,4,4,4,4,4,52,100,4,1, ,34,1,1,1,2,1,.942,100,7,7,0,45,1,0,1,0,0,0,0,0,0,0,0,0,1,0,0,0,0,0,0,0,0,0,0,0,1,0,0,1,0,0,0,1,1,0
5,1,8,1,3,1,2,2,4/1/2013,1,66,2,1, ,1,0,0,0,0,3,6,6,4,5.33,0,1,0,0,0,0,0, ,2,999,6,999,2,5,8,2,2,0,2,999,999,3,10,999,0,0,0,0,2,16,5,44,2.75,13.75,57.75,1,4,4,4,4,4,4,4,4,4,4,4,4,4,52,100,4,1,1,1,3,1,85,.927,3,1,6,0,0,0,1,5,5,5,5,5,5,5,5,5,5,5,5,1,1,5,5,5,10,10,10,10,1,1,1,1,1,4.67,3,1,1,4,4,4,4,4,3,4,4,4,4,4,4,4,51,91.6,4,0,-8.40000000000001,1,1,1,1,2,1,.942,90,.0149999999999999,5,0,0,0,0,5,1,5,5,5,5,5,5,5,5,5,5,2,1,4.67,3.67,5,10,10,10,10,1,1,1,1,1,4.67,4,4,4,4,4,3,3,3,3,3,3,3,3,44,70.8,4,0,0,-29.2,1,1,1,3,1,.927,75,2,2,0,66,0,0,1,0,0,0,0,1,0,0,0,0,1,0,0,0,0,0,0,0,0,0,0,0,1,0,0,1,0,0,0,1,1,0