cell,cell_ontology_class,cell_ontology_id,channel,cluster.ids,free_annotation,mouse.id,mouse.sex,subsetA,subsetA_cluster.ids,subsetB,subsetB_cluster.ids,subsetC,subsetC_cluster.ids,subsetD,subsetD_cluster.ids,subtissue,tissue,tissue_tSNE_1,tissue_tSNE_2
10X_P7_8_AAACGGGAGGATATAC,myeloid cell,CL:0000763,10X_P7_8,20,dendritic cells and interstital macrophages,3-F-56,F,,,,,,,,,,Lung,17.024720575519034,-32.902836424239034
10X_P7_8_AAACGGGTCTCGTATT,alveolar macrophage,CL:0000583,10X_P7_8,5,,3-F-56,F,,,,,,,,,,Lung,25.16061871816524,25.06656562878519
10X_P7_8_AAAGATGCAGATCTGT,B cell,CL:0000236,10X_P7_8,12,,3-F-56,F,,,,,,,,,,Lung,1.740566561622436,46.48887844735186
10X_P7_8_AAATGCCAGATAGTCA,natural killer cell,CL:0000623,10X_P7_8,7,,3-F-56,F,,,,,,,,,,Lung,-31.647933539568292,-2.2080610511467205
10X_P7_8_AAATGCCCAAACTGCT,T cell,CL:0000084,10X_P7_8,21,,3-F-56,F,,,,,,,,,,Lung,-37.28126626220561,-5.619565427332597
10X_P7_8_AAATGCCGTGAACCTT,alveolar macrophage,CL:0000583,10X_P7_8,5,,3-F-56,F,,,,,,,,,,Lung,25.79457246457573,22.374719391197985
10X_P7_8_AACACGTAGTGTACCT,lung endothelial cell,CL:1001567,10X_P7_8,22,,3-F-56,F,,,,,,,,,,Lung,16.157797512972742,34.38689835860357
10X_P7_8_AACACGTGTGGCTCCA,lung endothelial cell,CL:1001567,10X_P7_8,14,,3-F-56,F,,,,,,,,,,Lung,17.79343957081808,3.7011316719911034
10X_P7_8_AACCATGAGTTGTCGT,alveolar macrophage,CL:0000583,10X_P7_8,25,,3-F-56,F,,,,,,,,,,Lung,34.770663142876,20.495547973227467
10X_P7_8_AACCATGCACGTCAGC,stromal cell,CL:0000499,10X_P7_8,17,,3-F-56,F,,,,,,,,,,Lung,9.541124748154527,-9.922963684431302
10X_P7_8_AACCATGGTAATAGCA,lung endothelial cell,CL:1001567,10X_P7_8,9,,3-F-56,F,,,,,,,,,,Lung,27.671318543854195,0.6737916780869673
10X_P7_8_AACCATGTCTGTTGAG,myeloid cell,CL:0000763,10X_P7_8,20,dendritic cells and interstital macrophages,3-F-56,F,,,,,,,,,,Lung,17.635379159865426,-30.33378913668883
10X_P7_8_AACCGCGGTTACGGAG,natural killer cell,CL:0000623,10X_P7_8,0,,3-F-56,F,,,,,,,,,,Lung,-26.67135824703287,10.088973869409838
10X_P7_8_AACCGCGTCCTTGCCA,alveolar macrophage,CL:0000583,10X_P7_8,25,,3-F-56,F,,,,,,,,,,Lung,34.58450413830709,20.443141748963317
10X_P7_8_AACGTTGGTAGCTCCG,non-classical monocyte,CL:0000875,10X_P7_8,11,circulating monocytes,3-F-56,F,,,,,,,,,,Lung,28.347425698517604,-17.622159395552412
10X_P7_8_AACGTTGTCAACACAC,stromal cell,CL:0000499,10X_P7_8,10,,3-F-56,F,,,,,,,,,,Lung,-4.546893610835851,8.663804025023385
10X_P7_8_AACTCAGCATTTCACT,alveolar macrophage,CL:0000583,10X_P7_8,5,,3-F-56,F,,,,,,,,,,Lung,28.33651905986129,22.319813086902386
10X_P7_8_AACTCCCTCTTATCTG,lung endothelial cell,CL:1001567,10X_P7_8,14,,3-F-56,F,,,,,,,,,,Lung,23.01556929244453,-1.55417663732718
10X_P7_8_AACTCTTGTTCCAACA,alveolar macrophage,CL:0000583,10X_P7_8,25,,3-F-56,F,,,,,,,,,,Lung,34.608754778719785,20.28912994086409
10X_P7_8_AACTCTTTCTTGTTTG,lung endothelial cell,CL:1001567,10X_P7_8,22,,3-F-56,F,,,,,,,,,,Lung,15.804555826526911,35.92627652070691
10X_P7_8_AACTGGTGTTCAGTAC,leukocyte,CL:0000738,10X_P7_8,18,,3-F-56,F,,,,,,,,,,Lung,46.44695625639038,0.3103175327321545
10X_P7_8_AACTTTCAGAGCTGCA,alveolar macrophage,CL:0000583,10X_P7_8,5,,3-F-56,F,,,,,,,,,,Lung,27.87679449790174,23.938338935554622
10X_P7_8_AAGCCGCTCAGTTCGA,alveolar macrophage,CL:0000583,10X_P7_8,5,,3-F-56,F,,,,,,,,,,Lung,26.372447127913023,25.391703882347983
10X_P7_8_AAGGAGCCACTAGTAC,non-classical monocyte,CL:0000875,10X_P7_8,11,circulating monocytes,3-F-56,F,,,,,,,,,,Lung,30.612965157671386,-11.623028393535195
10X_P7_8_AAGGAGCCAGGAATCG,alveolar macrophage,CL:0000583,10X_P7_8,5,,3-F-56,F,,,,,,,,,,Lung,24.765608080085496,26.080991504198995
10X_P7_8_AAGGCAGTCTGCTTGC,T cell,CL:0000084,10X_P7_8,13,,3-F-56,F,,,,,,,,,,Lung,-33.961949597368125,-14.62771891709758
10X_P7_8_AAGGTTCTCAATCACG,lung endothelial cell,CL:1001567,10X_P7_8,9,,3-F-56,F,,,,,,,,,,Lung,30.302516352736284,2.575668756612191
10X_P7_8_AATCCAGGTACCGGCT,non-classical monocyte,CL:0000875,10X_P7_8,11,circulating monocytes,3-F-56,F,,,,,,,,,,Lung,34.88537794782609,-14.153527406267159
10X_P7_8_AATCGGTGTCGCATAT,lung endothelial cell,CL:1001567,10X_P7_8,22,,3-F-56,F,,,,,,,,,,Lung,15.90068122453349,35.20489730895673
10X_P7_8_ACACCGGCAAACCTAC,alveolar macrophage,CL:0000583,10X_P7_8,5,,3-F-56,F,,,,,,,,,,Lung,27.028293259245547,26.196928650382613
10X_P7_8_ACACCGGCATCCTAGA,stromal cell,CL:0000499,10X_P7_8,4,,3-F-56,F,,,,,,,,,,Lung,-15.428261802850814,27.163128309369878
10X_P7_8_ACACTGAAGACCTAGG,alveolar macrophage,CL:0000583,10X_P7_8,5,,3-F-56,F,,,,,,,,,,Lung,28.095866013760983,21.365385516505665
10X_P7_8_ACAGCCGGTAATTGGA,alveolar macrophage,CL:0000583,10X_P7_8,5,,3-F-56,F,,,,,,,,,,Lung,25.842821803193026,23.394362816276864
10X_P7_8_ACAGCCGTCACATAGC,lung endothelial cell,CL:1001567,10X_P7_8,9,,3-F-56,F,,,,,,,,,,Lung,28.71688830133903,5.156100252718486
10X_P7_8_ACAGCCGTCGACAGCC,alveolar macrophage,CL:0000583,10X_P7_8,5,,3-F-56,F,,,,,,,,,,Lung,20.515197411332814,14.244089460923865
10X_P7_8_ACAGCTACAAAGAATC,myeloid cell,CL:0000763,10X_P7_8,20,dendritic cells and interstital macrophages,3-F-56,F,,,,,,,,,,Lung,17.220277307968846,-30.919091656590272
10X_P7_8_ACAGCTAGTTCATGGT,natural killer cell,CL:0000623,10X_P7_8,7,,3-F-56,F,,,,,,,,,,Lung,-36.29697465942422,6.91055259506079
10X_P7_8_ACAGCTAGTTGGAGGT,natural killer cell,CL:0000623,10X_P7_8,7,,3-F-56,F,,,,,,,,,,Lung,-29.233693268776626,-0.07439717499894143
10X_P7_8_ACAGCTAGTTTAGCTG,alveolar macrophage,CL:0000583,10X_P7_8,5,,3-F-56,F,,,,,,,,,,Lung,20.851081168104614,17.895399752085474
10X_P7_8_ACATACGAGAGTTGGC,natural killer cell,CL:0000623,10X_P7_8,0,,3-F-56,F,,,,,,,,,,Lung,-21.127365207479603,3.44491982498584
10X_P7_8_ACATACGCAGCATGAG,classical monocyte,CL:0000860,10X_P7_8,15,invading monocytes,3-F-56,F,,,,,,,,,,Lung,28.50390413153129,-19.62834705801341
10X_P7_8_ACATCAGGTTTCGCTC,B cell,CL:0000236,10X_P7_8,12,,3-F-56,F,,,,,,,,,,Lung,-1.662289819348045,44.80303235544056
10X_P7_8_ACCAGTATCATCGGAT,stromal cell,CL:0000499,10X_P7_8,2,,3-F-56,F,,,,,,,,,,Lung,-4.835913094065087,-35.23408393463698
10X_P7_8_ACCAGTATCCCGACTT,lung endothelial cell,CL:1001567,10X_P7_8,9,,3-F-56,F,,,,,,,,,,Lung,31.662616285612053,-0.182145019156016
10X_P7_8_ACCCACTGTCTAAACC,classical monocyte,CL:0000860,10X_P7_8,15,invading monocytes,3-F-56,F,,,,,,,,,,Lung,25.004506588250514,-21.655601796855322
10X_P7_8_ACGAGGACAAGCCCAC,classical monocyte,CL:0000860,10X_P7_8,15,invading monocytes,3-F-56,F,,,,,,,,,,Lung,25.169588539537287,-23.162625843065484
10X_P7_8_ACGATGTGTAGGCATG,classical monocyte,CL:0000860,10X_P7_8,15,invading monocytes,3-F-56,F,,,,,,,,,,Lung,27.49713020201209,-20.17281115752914
10X_P7_8_ACGCAGCCAGGGTACA,alveolar macrophage,CL:0000583,10X_P7_8,5,,3-F-56,F,,,,,,,,,,Lung,21.535320632183666,19.08599791604899
10X_P7_8_ACGCCAGAGGCTCATT,stromal cell,CL:0000499,10X_P7_8,10,,3-F-56,F,,,,,,,,,,Lung,5.328031625623504,5.627948994563608
10X_P7_8_ACGCCAGTCGATGAGG,classical monocyte,CL:0000860,10X_P7_8,15,invading monocytes,3-F-56,F,,,,,,,,,,Lung,25.436979567978643,-24.201907536426226
10X_P7_8_ACGCCGACAATAAGCA,lung endothelial cell,CL:1001567,10X_P7_8,9,,3-F-56,F,,,,,,,,,,Lung,29.232927443168922,-0.6487318597559006
10X_P7_8_ACGGAGAAGTTAGCGG,ciliated columnar cell of tracheobronchial tree,CL:0002145,10X_P7_8,23,multiciliated cells,3-F-56,F,,,,,,,,,,Lung,6.721960435627532,58.380123925773326
10X_P7_8_ACGGAGAGTGAGTGAC,lung endothelial cell,CL:1001567,10X_P7_8,9,,3-F-56,F,,,,,,,,,,Lung,30.656902255303233,1.2460622542416993
10X_P7_8_ACGGCCAAGACAAGCC,lung endothelial cell,CL:1001567,10X_P7_8,14,,3-F-56,F,,,,,,,,,,Lung,20.711252724977612,4.104597810581439
10X_P7_8_ACGGCCACAATGGTCT,alveolar macrophage,CL:0000583,10X_P7_8,5,,3-F-56,F,,,,,,,,,,Lung,24.459566033531733,24.629883391299227
10X_P7_8_ACGGGCTCAGTCGTGC,type II pneumocyte,CL:0002063,10X_P7_8,19,alveolar epithelial type 2 cells,3-F-56,F,,,,,,,,,,Lung,-20.726855892491592,-30.307986759079185
10X_P7_8_ACGGGTCAGCTAAACA,lung endothelial cell,CL:1001567,10X_P7_8,22,,3-F-56,F,,,,,,,,,,Lung,14.127842707874427,34.51798940050309
10X_P7_8_ACGGGTCGTCGAACAG,classical monocyte,CL:0000860,10X_P7_8,15,invading monocytes,3-F-56,F,,,,,,,,,,Lung,27.715177054685523,-27.892912393939714
10X_P7_8_ACGGGTCTCGTAGATC,stromal cell,CL:0000499,10X_P7_8,4,,3-F-56,F,,,,,,,,,,Lung,-17.846750204998887,32.93573287192155
10X_P7_8_ACGTCAAAGGGCATGT,stromal cell,CL:0000499,10X_P7_8,2,,3-F-56,F,,,,,,,,,,Lung,-7.0131671639781406,-33.875355379670644
10X_P7_8_ACGTCAAGTTCAACCA,stromal cell,CL:0000499,10X_P7_8,17,,3-F-56,F,,,,,,,,,,Lung,16.82860461303848,3.339299405981917
10X_P7_8_ACTATCTGTGTAATGA,lung endothelial cell,CL:1001567,10X_P7_8,22,,3-F-56,F,,,,,,,,,,Lung,13.905574013062616,33.10796034464535
10X_P7_8_ACTATCTTCCCGGATG,leukocyte,CL:0000738,10X_P7_8,18,,3-F-56,F,,,,,,,,,,Lung,47.508984156059334,0.7399388349875613
10X_P7_8_ACTGAACAGCCCGAAA,alveolar macrophage,CL:0000583,10X_P7_8,5,,3-F-56,F,,,,,,,,,,Lung,26.5016469956993,20.201588423418187
10X_P7_8_ACTGAACGTTCCCGAG,alveolar macrophage,CL:0000583,10X_P7_8,5,,3-F-56,F,,,,,,,,,,Lung,25.830764261134497,23.210966537304056
10X_P7_8_ACTGAACTCGTGTAGT,classical monocyte,CL:0000860,10X_P7_8,15,invading monocytes,3-F-56,F,,,,,,,,,,Lung,27.465248796836896,-26.61861157801677
10X_P7_8_ACTGATGCACGGCTAC,non-classical monocyte,CL:0000875,10X_P7_8,11,circulating monocytes,3-F-56,F,,,,,,,,,,Lung,32.15775905289175,-10.532879962170949
10X_P7_8_ACTGATGTCATAAAGG,alveolar macrophage,CL:0000583,10X_P7_8,5,,3-F-56,F,,,,,,,,,,Lung,25.421223759391758,25.508807837170433
10X_P7_8_ACTGCTCCAAGTACCT,lung endothelial cell,CL:1001567,10X_P7_8,14,,3-F-56,F,,,,,,,,,,Lung,20.251865669298986,6.531406861458014
10X_P7_8_ACTGCTCCACAAGCCC,T cell,CL:0000084,10X_P7_8,13,,3-F-56,F,,,,,,,,,,Lung,-40.71132987945021,-10.80269625043176
10X_P7_8_ACTGTCCAGTGTACGG,alveolar macrophage,CL:0000583,10X_P7_8,5,,3-F-56,F,,,,,,,,,,Lung,26.301391447503768,26.04988141831741
10X_P7_8_ACTTACTCAGCTCGAC,myeloid cell,CL:0000763,10X_P7_8,20,dendritic cells and interstital macrophages,3-F-56,F,,,,,,,,,,Lung,16.339685433724142,-32.69174114800197
10X_P7_8_ACTTGTTCATATGGTC,lung endothelial cell,CL:1001567,10X_P7_8,14,,3-F-56,F,,,,,,,,,,Lung,19.212107769521342,4.981981539149492
10X_P7_8_ACTTGTTGTAAACCTC,alveolar macrophage,CL:0000583,10X_P7_8,5,,3-F-56,F,,,,,,,,,,Lung,25.400064354920058,25.715958380057888
10X_P7_8_ACTTTCAGTTGACGTT,T cell,CL:0000084,10X_P7_8,13,,3-F-56,F,,,,,,,,,,Lung,-37.16078300403245,-11.132733893917523
10X_P7_8_ACTTTCAGTTTGACTG,ciliated columnar cell of tracheobronchial tree,CL:0002145,10X_P7_8,23,multiciliated cells,3-F-56,F,,,,,,,,,,Lung,6.835211808886897,58.23193017638084
10X_P7_8_AGAATAGTCCTAGAAC,alveolar macrophage,CL:0000583,10X_P7_8,5,,3-F-56,F,,,,,,,,,,Lung,30.61245559870852,21.46943761481502
10X_P7_8_AGACGTTGTCCGAGTC,myeloid cell,CL:0000763,10X_P7_8,20,dendritic cells and interstital macrophages,3-F-56,F,,,,,,,,,,Lung,16.420421566792715,-33.55576824295542
10X_P7_8_AGAGCGACAAGCGTAG,stromal cell,CL:0000499,10X_P7_8,1,,3-F-56,F,,,,,,,,,,Lung,-13.094842175282269,-23.22483570751867
10X_P7_8_AGAGCGATCTGCCAGG,alveolar macrophage,CL:0000583,10X_P7_8,5,,3-F-56,F,,,,,,,,,,Lung,28.634681254508273,25.70660201561654
10X_P7_8_AGAGTGGAGATCCCGC,alveolar macrophage,CL:0000583,10X_P7_8,5,,3-F-56,F,,,,,,,,,,Lung,21.648248207325526,19.378870596471163
10X_P7_8_AGAGTGGAGTAGTGCG,alveolar macrophage,CL:0000583,10X_P7_8,5,,3-F-56,F,,,,,,,,,,Lung,23.122370671782875,22.77142451844975
10X_P7_8_AGAGTGGTCATGTCCC,non-classical monocyte,CL:0000875,10X_P7_8,11,circulating monocytes,3-F-56,F,,,,,,,,,,Lung,29.176593521813544,-17.77674051073564
10X_P7_8_AGAGTGGTCGAACTGT,alveolar macrophage,CL:0000583,10X_P7_8,5,,3-F-56,F,,,,,,,,,,Lung,26.18056378324997,22.21500937296715
10X_P7_8_AGAGTGGTCTGATTCT,lung endothelial cell,CL:1001567,10X_P7_8,22,,3-F-56,F,,,,,,,,,,Lung,15.38397393824925,34.745691116723
10X_P7_8_AGATCTGGTCTTCGTC,natural killer cell,CL:0000623,10X_P7_8,7,,3-F-56,F,,,,,,,,,,Lung,-33.61519784691238,8.109351239736007
10X_P7_8_AGATCTGTCACGCATA,B cell,CL:0000236,10X_P7_8,12,,3-F-56,F,,,,,,,,,,Lung,1.149505829921426,44.19269589338185
10X_P7_8_AGATTGCAGAGCAATT,myeloid cell,CL:0000763,10X_P7_8,20,dendritic cells and interstital macrophages,3-F-56,F,,,,,,,,,,Lung,18.929283114791538,-32.28009710561945
10X_P7_8_AGCATACCAAGAGTCG,T cell,CL:0000084,10X_P7_8,13,,3-F-56,F,,,,,,,,,,Lung,-34.9831705916337,-14.080721084677505
10X_P7_8_AGCCTAAAGAAGGGTA,lung endothelial cell,CL:1001567,10X_P7_8,22,,3-F-56,F,,,,,,,,,,Lung,14.506383439877984,35.49436826523055
10X_P7_8_AGCGGTCCATGGTCAT,T cell,CL:0000084,10X_P7_8,21,,3-F-56,F,,,,,,,,,,Lung,-34.786149633895576,-8.010118334447402
10X_P7_8_AGCTCCTAGCAGGCTA,alveolar macrophage,CL:0000583,10X_P7_8,5,,3-F-56,F,,,,,,,,,,Lung,22.573774957603263,18.528764736853518
10X_P7_8_AGCTCCTTCCGCGTTT,classical monocyte,CL:0000860,10X_P7_8,15,invading monocytes,3-F-56,F,,,,,,,,,,Lung,28.56534107463715,-19.52842290606096
10X_P7_8_AGCTCCTTCCTTAATC,lung endothelial cell,CL:1001567,10X_P7_8,14,,3-F-56,F,,,,,,,,,,Lung,20.899652590012394,0.4334245568381141
10X_P7_8_AGCTCTCTCGATGAGG,B cell,CL:0000236,10X_P7_8,12,,3-F-56,F,,,,,,,,,,Lung,-0.1905694466455477,38.86530773234981
10X_P7_8_AGCTTGAAGCCGATTT,myeloid cell,CL:0000763,10X_P7_8,20,dendritic cells and interstital macrophages,3-F-56,F,,,,,,,,,,Lung,18.47769433713562,-29.92638282565024
10X_P7_8_AGGGAGTCAACTGCGC,leukocyte,CL:0000738,10X_P7_8,18,,3-F-56,F,,,,,,,,,,Lung,44.962537420202224,-0.14584148435456012
10X_P7_8_AGGGAGTTCCGCGCAA,lung endothelial cell,CL:1001567,10X_P7_8,9,,3-F-56,F,,,,,,,,,,Lung,26.45187468543743,2.697311165771978
10X_P7_8_AGGGATGGTCTAACGT,ciliated columnar cell of tracheobronchial tree,CL:0002145,10X_P7_8,23,multiciliated cells,3-F-56,F,,,,,,,,,,Lung,6.8891494103870095,57.42962881425323
10X_P7_8_AGGGATGTCCCGGATG,B cell,CL:0000236,10X_P7_8,12,,3-F-56,F,,,,,,,,,,Lung,-1.1534827457393595,41.785964695623065
10X_P7_8_AGGTCATAGCGTCTAT,natural killer cell,CL:0000623,10X_P7_8,7,,3-F-56,F,,,,,,,,,,Lung,-37.611628033942644,8.00542132949808
10X_P7_8_AGGTCATTCACGCGGT,alveolar macrophage,CL:0000583,10X_P7_8,25,,3-F-56,F,,,,,,,,,,Lung,34.741060844320536,20.467607238327343
10X_P7_8_AGGTCCGCAACAACCT,classical monocyte,CL:0000860,10X_P7_8,15,invading monocytes,3-F-56,F,,,,,,,,,,Lung,26.87544065457661,-25.913136115269683
10X_P7_8_AGGTCCGCACTTAAGC,T cell,CL:0000084,10X_P7_8,13,,3-F-56,F,,,,,,,,,,Lung,-34.75333408553593,-14.195033067755187
10X_P7_8_AGGTCCGCATCGGACC,classical monocyte,CL:0000860,10X_P7_8,15,invading monocytes,3-F-56,F,,,,,,,,,,Lung,25.81863347845646,-25.105236494394692
10X_P7_8_AGGTCCGTCATCGGAT,B cell,CL:0000236,10X_P7_8,12,,3-F-56,F,,,,,,,,,,Lung,0.6079075045184822,46.054167190553045
10X_P7_8_AGTCTTTCAATGAATG,lung endothelial cell,CL:1001567,10X_P7_8,9,,3-F-56,F,,,,,,,,,,Lung,31.651922689366987,0.059366569481435774
10X_P7_8_AGTCTTTGTCTCTCGT,classical monocyte,CL:0000860,10X_P7_8,15,invading monocytes,3-F-56,F,,,,,,,,,,Lung,24.88419001687823,-23.633792464010803
10X_P7_8_AGTCTTTTCATGTGGT,lung endothelial cell,CL:1001567,10X_P7_8,9,,3-F-56,F,,,,,,,,,,Lung,31.894865663109517,0.013940161343718477
10X_P7_8_AGTGAGGGTTACCGAT,stromal cell,CL:0000499,10X_P7_8,8,,3-F-56,F,,,,,,,,,,Lung,2.6702965047259717,10.471663447061825
10X_P7_8_AGTGTCATCTTCAACT,stromal cell,CL:0000499,10X_P7_8,3,,3-F-56,F,,,,,,,,,,Lung,-0.8925641136597271,-8.245496141653659
10X_P7_8_AGTTGGTGTAGAGTGC,stromal cell,CL:0000499,10X_P7_8,2,,3-F-56,F,,,,,,,,,,Lung,-5.6475002231005975,-34.02586177365194
10X_P7_8_ATAACGCTCCCATTTA,lung endothelial cell,CL:1001567,10X_P7_8,9,,3-F-56,F,,,,,,,,,,Lung,24.89128552094707,1.8127166276659343
10X_P7_8_ATAAGAGAGCACACAG,lung endothelial cell,CL:1001567,10X_P7_8,14,,3-F-56,F,,,,,,,,,,Lung,23.881504400898546,-0.8107486541971328
10X_P7_8_ATAAGAGCAGCTATTG,alveolar macrophage,CL:0000583,10X_P7_8,5,,3-F-56,F,,,,,,,,,,Lung,21.22018590911236,18.51893747840997
10X_P7_8_ATAAGAGGTCCGTTAA,stromal cell,CL:0000499,10X_P7_8,2,,3-F-56,F,,,,,,,,,,Lung,-4.321377024972657,-35.34049049424231
10X_P7_8_ATAAGAGTCGCCAGCA,alveolar macrophage,CL:0000583,10X_P7_8,5,,3-F-56,F,,,,,,,,,,Lung,26.631585479438357,25.53171304088715
10X_P7_8_ATCATCTGTTCGGCAC,stromal cell,CL:0000499,10X_P7_8,3,,3-F-56,F,,,,,,,,,,Lung,-10.989152174561909,-5.3259174729333525
10X_P7_8_ATCATCTTCCTTAATC,classical monocyte,CL:0000860,10X_P7_8,15,invading monocytes,3-F-56,F,,,,,,,,,,Lung,23.85035257791482,-24.43037597324137
10X_P7_8_ATCCACCGTGTATGGG,lung endothelial cell,CL:1001567,10X_P7_8,9,,3-F-56,F,,,,,,,,,,Lung,39.61949920593476,2.860728311418628
10X_P7_8_ATCCGAAAGCCTTGAT,lung endothelial cell,CL:1001567,10X_P7_8,9,,3-F-56,F,,,,,,,,,,Lung,32.790308456207036,3.9089260502980623
10X_P7_8_ATCCGAAGTGAAATCA,stromal cell,CL:0000499,10X_P7_8,4,,3-F-56,F,,,,,,,,,,Lung,-19.40700568678525,30.944023261028768
10X_P7_8_ATCGAGTGTACCGCTG,B cell,CL:0000236,10X_P7_8,12,,3-F-56,F,,,,,,,,,,Lung,-1.0287790365914309,43.63497561307154
10X_P7_8_ATCTGCCTCCCTAACC,classical monocyte,CL:0000860,10X_P7_8,15,invading monocytes,3-F-56,F,,,,,,,,,,Lung,23.68010559850431,-22.66301178531411
10X_P7_8_ATGCGATCACATTAGC,natural killer cell,CL:0000623,10X_P7_8,7,,3-F-56,F,,,,,,,,,,Lung,-35.295613798104405,6.927940897917049
10X_P7_8_ATGGGAGAGCAAATCA,leukocyte,CL:0000738,10X_P7_8,18,,3-F-56,F,,,,,,,,,,Lung,45.72877360767407,-0.2784673448399733
10X_P7_8_ATTACTCGTATGCTTG,stromal cell,CL:0000499,10X_P7_8,16,,3-F-56,F,,,,,,,,,,Lung,10.504433411136313,19.20801345593351
10X_P7_8_ATTATCCAGGAATCGC,lung endothelial cell,CL:1001567,10X_P7_8,14,,3-F-56,F,,,,,,,,,,Lung,22.48750537909694,3.4817077831420864
10X_P7_8_ATTATCCAGGCTCTTA,lung endothelial cell,CL:1001567,10X_P7_8,22,,3-F-56,F,,,,,,,,,,Lung,14.913601056857749,34.59902986212265
10X_P7_8_ATTATCCGTCGTTGTA,myeloid cell,CL:0000763,10X_P7_8,20,dendritic cells and interstital macrophages,3-F-56,F,,,,,,,,,,Lung,17.554721317406962,-30.649821529325088
10X_P7_8_ATTCTACAGATCACGG,myeloid cell,CL:0000763,10X_P7_8,20,dendritic cells and interstital macrophages,3-F-56,F,,,,,,,,,,Lung,18.520360871510658,-29.923429191334964
10X_P7_8_ATTGGACGTCATATGC,stromal cell,CL:0000499,10X_P7_8,8,,3-F-56,F,,,,,,,,,,Lung,0.46835365023919395,13.390122952250655
10X_P7_8_ATTTCTGCAGCCTTTC,alveolar macrophage,CL:0000583,10X_P7_8,5,,3-F-56,F,,,,,,,,,,Lung,25.94148249778027,26.432835017665724
10X_P7_8_ATTTCTGGTAGTGAAT,lung endothelial cell,CL:1001567,10X_P7_8,9,,3-F-56,F,,,,,,,,,,Lung,40.13129963050362,2.8228452110909914
10X_P7_8_CAACCAATCATGTCCC,B cell,CL:0000236,10X_P7_8,12,,3-F-56,F,,,,,,,,,,Lung,1.5438534509104112,46.14908938049404
10X_P7_8_CAACTAGCAGCCTGTG,stromal cell,CL:0000499,10X_P7_8,16,,3-F-56,F,,,,,,,,,,Lung,9.490519705560583,23.819194063696717
10X_P7_8_CAAGAAATCAACGAAA,stromal cell,CL:0000499,10X_P7_8,3,,3-F-56,F,,,,,,,,,,Lung,-12.774586474865876,-10.079686456890013
10X_P7_8_CAAGAAATCAGTTCGA,stromal cell,CL:0000499,10X_P7_8,1,,3-F-56,F,,,,,,,,,,Lung,-12.576617826263226,-23.862048109569148
10X_P7_8_CAAGATCAGCAATATG,classical monocyte,CL:0000860,10X_P7_8,15,invading monocytes,3-F-56,F,,,,,,,,,,Lung,25.82089222859557,-19.21168540663213
10X_P7_8_CAAGTTGCAGCTTCGG,leukocyte,CL:0000738,10X_P7_8,18,,3-F-56,F,,,,,,,,,,Lung,40.33565932806168,2.7329403351716954
10X_P7_8_CAAGTTGGTCTACCTC,stromal cell,CL:0000499,10X_P7_8,2,,3-F-56,F,,,,,,,,,,Lung,-9.97800532793441,-31.265827035968194
10X_P7_8_CACAAACGTGCGATAG,alveolar macrophage,CL:0000583,10X_P7_8,5,,3-F-56,F,,,,,,,,,,Lung,27.156350549797178,24.983929576508665
10X_P7_8_CACACAAAGGATGTAT,alveolar macrophage,CL:0000583,10X_P7_8,5,,3-F-56,F,,,,,,,,,,Lung,28.56280131943823,25.994777944394446
10X_P7_8_CACACCTCAGTCAGCC,T cell,CL:0000084,10X_P7_8,21,,3-F-56,F,,,,,,,,,,Lung,-35.165134676518896,-7.5567276467098425
10X_P7_8_CACACCTTCCAAAGTC,lung endothelial cell,CL:1001567,10X_P7_8,22,,3-F-56,F,,,,,,,,,,Lung,14.523742483696571,31.94351879904308
10X_P7_8_CACAGGCCACACTGCG,lung endothelial cell,CL:1001567,10X_P7_8,9,,3-F-56,F,,,,,,,,,,Lung,30.78278241456212,-0.6175857124305294
10X_P7_8_CACATAGCAATAGCGG,lung endothelial cell,CL:1001567,10X_P7_8,9,,3-F-56,F,,,,,,,,,,Lung,27.725517695335178,0.1720149331194587
10X_P7_8_CACATAGTCGTCCAGG,lung endothelial cell,CL:1001567,10X_P7_8,9,,3-F-56,F,,,,,,,,,,Lung,30.846967449626234,-0.6781464707054939
10X_P7_8_CACCTTGAGTTCCACA,alveolar macrophage,CL:0000583,10X_P7_8,5,,3-F-56,F,,,,,,,,,,Lung,26.93205235225007,26.56872575641384
10X_P7_8_CACCTTGGTGTCAATC,alveolar macrophage,CL:0000583,10X_P7_8,5,,3-F-56,F,,,,,,,,,,Lung,25.699393700713443,22.956623631438767
10X_P7_8_CACCTTGTCAGTTTGG,classical monocyte,CL:0000860,10X_P7_8,15,invading monocytes,3-F-56,F,,,,,,,,,,Lung,26.13554985322812,-26.29512199117561
10X_P7_8_CAGAATCAGGCAGTCA,non-classical monocyte,CL:0000875,10X_P7_8,11,circulating monocytes,3-F-56,F,,,,,,,,,,Lung,33.19958003602138,-10.27907523776784
10X_P7_8_CAGAGAGCATCGGACC,alveolar macrophage,CL:0000583,10X_P7_8,5,,3-F-56,F,,,,,,,,,,Lung,21.4144630222948,22.00836434492724
10X_P7_8_CAGCAGCAGGGTGTGT,alveolar macrophage,CL:0000583,10X_P7_8,5,,3-F-56,F,,,,,,,,,,Lung,20.21757333244208,22.81214500683762
10X_P7_8_CAGCAGCGTCCTCTTG,alveolar macrophage,CL:0000583,10X_P7_8,5,,3-F-56,F,,,,,,,,,,Lung,22.571991098742195,16.612986952614538
10X_P7_8_CAGCATAGTGCATCTA,lung endothelial cell,CL:1001567,10X_P7_8,14,,3-F-56,F,,,,,,,,,,Lung,19.829341942557193,6.967174580707152
10X_P7_8_CAGCGACTCATTTGGG,lung endothelial cell,CL:1001567,10X_P7_8,9,,3-F-56,F,,,,,,,,,,Lung,32.858336882951825,3.3398608182456693
10X_P7_8_CAGTAACAGATAGTCA,stromal cell,CL:0000499,10X_P7_8,4,,3-F-56,F,,,,,,,,,,Lung,-19.770553157385287,29.261059758162883
10X_P7_8_CAGTAACAGGATCGCA,lung endothelial cell,CL:1001567,10X_P7_8,14,,3-F-56,F,,,,,,,,,,Lung,18.55569757514165,3.8256610402211058
10X_P7_8_CAGTCCTTCCAAAGTC,type II pneumocyte,CL:0002063,10X_P7_8,19,alveolar epithelial type 2 cells,3-F-56,F,,,,,,,,,,Lung,-24.59467319522473,-30.614977533361273
10X_P7_8_CAGTCCTTCTAACTGG,non-classical monocyte,CL:0000875,10X_P7_8,11,circulating monocytes,3-F-56,F,,,,,,,,,,Lung,29.257916839200014,-16.9288079028987
10X_P7_8_CATATGGAGTTTCCTT,alveolar macrophage,CL:0000583,10X_P7_8,25,,3-F-56,F,,,,,,,,,,Lung,34.78673669080145,20.5377716789387
10X_P7_8_CATATGGCACAGGTTT,stromal cell,CL:0000499,10X_P7_8,3,,3-F-56,F,,,,,,,,,,Lung,-14.136538871512904,-5.940987335084367
10X_P7_8_CATATGGGTGTTTGTG,stromal cell,CL:0000499,10X_P7_8,3,,3-F-56,F,,,,,,,,,,Lung,-13.430908351532985,-6.569567346229353
10X_P7_8_CATATGGTCGTGGACC,natural killer cell,CL:0000623,10X_P7_8,7,,3-F-56,F,,,,,,,,,,Lung,-31.211486133172702,-2.0249837819298198
10X_P7_8_CATATTCGTCGAATCT,alveolar macrophage,CL:0000583,10X_P7_8,5,,3-F-56,F,,,,,,,,,,Lung,25.626352187297197,22.078593654662267
10X_P7_8_CATCCACAGATGGCGT,type II pneumocyte,CL:0002063,10X_P7_8,19,alveolar epithelial type 2 cells,3-F-56,F,,,,,,,,,,Lung,-23.128523357505173,-31.367084943049026
10X_P7_8_CATCCACTCGGTGTCG,alveolar macrophage,CL:0000583,10X_P7_8,5,,3-F-56,F,,,,,,,,,,Lung,26.21432697916865,26.98098620360355
10X_P7_8_CATCGGGCAGATGAGC,lung endothelial cell,CL:1001567,10X_P7_8,14,,3-F-56,F,,,,,,,,,,Lung,17.834025236397522,4.793892968369003
10X_P7_8_CATCGGGTCAGCTGGC,stromal cell,CL:0000499,10X_P7_8,4,,3-F-56,F,,,,,,,,,,Lung,-11.179094703614984,24.58742822635254
10X_P7_8_CATCGGGTCTCGCATC,alveolar macrophage,CL:0000583,10X_P7_8,5,,3-F-56,F,,,,,,,,,,Lung,24.234637074036666,24.147478026406713
10X_P7_8_CATGACAGTATAAACG,lung endothelial cell,CL:1001567,10X_P7_8,9,,3-F-56,F,,,,,,,,,,Lung,27.416812493937698,0.4679358051300648
10X_P7_8_CATGGCGGTGCGATAG,lung endothelial cell,CL:1001567,10X_P7_8,22,,3-F-56,F,,,,,,,,,,Lung,14.257850430212427,32.224356819855316
10X_P7_8_CCAATCCAGCAAATCA,alveolar macrophage,CL:0000583,10X_P7_8,5,,3-F-56,F,,,,,,,,,,Lung,23.220016667600174,18.847807397523187
10X_P7_8_CCACCTAAGGCCCGTT,non-classical monocyte,CL:0000875,10X_P7_8,11,circulating monocytes,3-F-56,F,,,,,,,,,,Lung,33.074416732085595,-12.250406073518475
10X_P7_8_CCACGGAGTAGAAGGA,lung endothelial cell,CL:1001567,10X_P7_8,9,,3-F-56,F,,,,,,,,,,Lung,27.44505287686118,-0.4858922382222075
10X_P7_8_CCACGGATCAGCTCGG,lung endothelial cell,CL:1001567,10X_P7_8,22,,3-F-56,F,,,,,,,,,,Lung,16.023926823899956,35.822556977828874