health_facility,Treatment_site,fcd_type,adhscore_lastappt,sex,age_cat,region,initiation_cat,ever_rep,adhlastappt,facilitylevel,retention,adh7_lastappt,strata
Madi Opei HCIV,Control,,Good,male,20-49,Mid-Northern,>2 yrs,Yes,Yes,HCIV,Retained,Non-Adherent,5
Agwatta HCIII,Control,,Good,female,,Mid-Northern,<3 months,No,Yes,HCIII,Retained,Adherent,3
Kitgum Hospital,Control,,Good,female,,Mid-Northern,>2 yrs,No,Yes,Hospital,Retained,Adherent,6
Mwera HCIV,Control,,Good,female,20-49,Central 1 and 2,1-2 yrs,No,Yes,HCIV,Not Retained,,2
Kyantungo HCIV,Control,,,female,,Central 1 and 2,>2 yrs,No,Yes,HCIV,Retained,Adherent,10
Mwera HCIV,Control,,Good,female,50+,Central 1 and 2,>2 yrs,No,Yes,HCIV,Retained,Adherent,2
Madi Opei HCIV,Control,,Good,female,,Mid-Northern,>2 yrs,No,Yes,HCIV,Retained,Adherent,5
Palabek-Kal HCIII,Control,,,female,,Mid-Northern,>2 yrs,No,Yes,HCIII,Retained,Adherent,3
Mwera HCIV,Control,,Good,female,20-49,Central 1 and 2,>2 yrs,No,Yes,HCIV,Retained,Non-Adherent,2
Aduku HCIV,Control,,Good,male,20-49,Mid-Northern,>2 yrs,Yes,No,HCIV,Retained,Non-Adherent,5
Atanga HCIII,Control,,Good,male,20-49,Mid-Northern,>2 yrs,No,Yes,HCIII,Retained,Adherent,4
Agwatta HCIII,Control,,,male,,Mid-Northern,>2 yrs,No,Yes,HCIII,Retained,Adherent,3
Ngogwe HCIII,Control,,Good,female,50+,Central 1 and 2,>2 yrs,No,Yes,HCIII,Retained,Adherent,1
Bududa Hospital,Control,,Good,female,,Mid-Eastern,>2 yrs,No,Yes,Hospital,Retained,Adherent,9
Madi Opei HCIV,Control,,Good,male,20-49,Mid-Northern,>2 yrs,No,Yes,HCIV,Retained,Adherent,5
Lumino HCIII,Control,,Good,male,20-49,Mid-Eastern,Less than 1 yr,Yes,No,HCIII,Retained,Adherent,7
Agwatta HCIII,Control,,Good,female,,Mid-Northern,1-2 yrs,No,Yes,HCIII,Retained,Adherent,3
Kalagala HCIV,Control,,,female,,Central 1 and 2,>2 yrs,No,Yes,HCIV,Retained,Adherent,10
Kitgum Hospital,Control,,,female,20-49,Mid-Northern,>2 yrs,No,No,Hospital,Retained,Adherent,6
Orum HCIV,Control,,Good,male,20-49,Mid-Northern,>2 yrs,Yes,No,HCIV,Retained,Non-Adherent,5
Lumino HCIII,Control,,Good,female,20-49,Mid-Eastern,>2 yrs,Yes,Yes,HCIII,Retained,Adherent,7
Kyantungo HCIV,Control,,Good,female,20-49,Central 1 and 2,>2 yrs,No,Yes,HCIV,Retained,Adherent,10
Kwera HCIII,Control,,Good,female,,Mid-Northern,1-2 yrs,No,No,HCIII,Retained,Adherent,3
Bala HCIII,Control,,,female,,Mid-Northern,<3 months,No,Yes,HCIII,Retained,,3
Atanga HCIII,Control,,Good,male,,Mid-Northern,>2 yrs,No,Yes,HCIII,Retained,Adherent,4
Agwatta HCIII,Control,,Good,female,,Mid-Northern,Less than 1 yr,No,Yes,HCIII,Retained,Adherent,3
Busia HCIV,Control,,Good,female,,Mid-Eastern,1-2 yrs,No,Yes,HCIV,Retained,Adherent,8
Masafu General Hospital,Control,,Good,female,,Mid-Eastern,>2 yrs,No,Yes,Hospital,Retained,Adherent,9
Ngogwe HCIII,Control,,Good,female,20-49,Central 1 and 2,1-2 yrs,No,Yes,HCIII,Retained,Adherent,1
Kalagala HCIV,Control,,Good,female,,Central 1 and 2,>2 yrs,No,Yes,HCIV,Retained,Adherent,10
Dokolo HCIV,Control,,Good,male,20-49,Mid-Northern,,No,No,HCIV,Retained,Adherent,5
Dokolo HCIV,Control,,Good,female,,Mid-Northern,>2 yrs,No,No,HCIV,Retained,Adherent,5
Dokolo HCIV,Control,,Good,female,<20,Mid-Northern,Less than 1 yr,No,Yes,HCIV,Retained,Adherent,5
Ngogwe HCIII,Control,,Good,female,<20,Central 1 and 2,,Yes,Yes,HCIII,Retained,Adherent,1
Ogur HCIV,Control,,Good,male,20-49,Mid-Northern,>2 yrs,No,Yes,HCIV,Not Retained,Adherent,5
Kitgum Hospital,Control,,Good,female,20-49,Mid-Northern,>2 yrs,No,No,Hospital,Retained,Adherent,6
Kangai HCIII,Control,,Good,female,,Mid-Northern,1-2 yrs,No,Yes,HCIII,Retained,Adherent,3
Palabek-Kal HCIII,Control,,Good,female,,Mid-Northern,>2 yrs,No,Yes,HCIII,Retained,,3
Masafu General Hospital,Control,,Good,female,,Mid-Eastern,Less than 1 yr,No,No,Hospital,Retained,Adherent,9
Ogur HCIV,Control,,Good,female,,Mid-Northern,>2 yrs,No,No,HCIV,Retained,Adherent,5
Bala HCIII,Control,,,male,,Mid-Northern,Less than 1 yr,No,No,HCIII,Retained,Adherent,3
Kalagala HCIV,Control,,,male,,Central 1 and 2,>2 yrs,No,Yes,HCIV,Retained,Adherent,10
Atanga HCIII,Control,,Good,male,,Mid-Northern,>2 yrs,No,Yes,HCIII,Retained,Adherent,4
Kitgum Hospital,Control,,Good,female,20-49,Mid-Northern,>2 yrs,No,Yes,Hospital,Retained,Adherent,6
Kwera HCIII,Control,,Good,female,,Mid-Northern,<3 months,No,Yes,HCIII,Retained,,3
Kyantungo HCIV,Control,,Good,female,20-49,Central 1 and 2,>2 yrs,Yes,Yes,HCIV,Retained,Adherent,10
Kangai HCIII,Control,,Good,female,20-49,Mid-Northern,<3 months,No,No,HCIII,Retained,Non-Adherent,3
Atanga HCIII,Control,,Good,female,,Mid-Northern,>2 yrs,No,No,HCIII,Retained,Adherent,4
Mwera HCIV,Control,,Good,female,50+,Central 1 and 2,>2 yrs,No,No,HCIV,Retained,Adherent,2
Lumino HCIII,Control,,Good,male,20-49,Mid-Eastern,1-2 yrs,Yes,Yes,HCIII,Retained,Adherent,7
Masafu General Hospital,Control,,Good,male,,Mid-Eastern,Less than 1 yr,No,No,Hospital,Retained,Adherent,9
Kalagala HCIV,Control,,Good,female,,Central 1 and 2,Less than 1 yr,No,No,HCIV,Retained,Adherent,10
Ngogwe HCIII,Control,,Poor,male,,Central 1 and 2,>2 yrs,Yes,Yes,HCIII,Retained,Non-Adherent,1
Kyantungo HCIV,Control,,Good,male,20-49,Central 1 and 2,>2 yrs,Yes,No,HCIV,Retained,Non-Adherent,10
Masafu General Hospital,Control,,Good,male,20-49,Mid-Eastern,>2 yrs,No,Yes,Hospital,Retained,Adherent,9
Kalagala HCIV,Control,,,male,,Central 1 and 2,>2 yrs,Yes,Yes,HCIV,Retained,Adherent,10
Ngogwe HCIII,Control,,Good,female,20-49,Central 1 and 2,,No,Yes,HCIII,Retained,Adherent,1
Kalagala HCIV,Control,,,female,,Central 1 and 2,1-2 yrs,No,Yes,HCIV,Retained,,10
Ngogwe HCIII,Control,,Good,female,<20,Central 1 and 2,Less than 1 yr,No,Yes,HCIII,Retained,Non-Adherent,1
Orum HCIV,Control,,Good,male,,Mid-Northern,>2 yrs,Yes,No,HCIV,Retained,Non-Adherent,5
Kitgum Hospital,Control,,Good,female,20-49,Mid-Northern,>2 yrs,No,Yes,Hospital,Retained,Adherent,6
Ngogwe HCIII,Control,,Good,male,20-49,Central 1 and 2,>2 yrs,No,Yes,HCIII,Retained,Non-Adherent,1
Kwera HCIII,Control,,,female,,Mid-Northern,Less than 1 yr,No,Yes,HCIII,Retained,Adherent,3
Lumino HCIII,Control,,Good,male,20-49,Mid-Eastern,>2 yrs,No,Yes,HCIII,Retained,Adherent,7
Mwera HCIV,Control,,Good,female,20-49,Central 1 and 2,>2 yrs,No,Yes,HCIV,Retained,,2
Kwera HCIII,Control,,Poor,male,,Mid-Northern,1-2 yrs,Yes,Yes,HCIII,Retained,Non-Adherent,3
Namasale HCIII,Control,,Fair,male,20-49,Mid-Northern,>2 yrs,Yes,Yes,HCIII,Retained,Adherent,4
Mwera HCIV,Control,,,female,50+,Central 1 and 2,>2 yrs,No,No,HCIV,Retained,Non-Adherent,2
Masafu General Hospital,Control,,Good,male,,Mid-Eastern,1-2 yrs,Yes,No,Hospital,Retained,Adherent,9
Kyazanga HCIV,Control,,Good,female,,Central 1 and 2,>2 yrs,No,Yes,HCIV,Retained,Adherent,2
Kwera HCIII,Control,,Good,female,,Mid-Northern,Less than 1 yr,No,No,HCIII,Retained,Adherent,3
Lumino HCIII,Control,,,female,20-49,Mid-Eastern,1-2 yrs,No,Yes,HCIII,Retained,Adherent,7
Kalagala HCIV,Control,,,male,,Central 1 and 2,Less than 1 yr,No,No,HCIV,Retained,Non-Adherent,10
Dokolo HCIV,Control,,Fair,female,,Mid-Northern,>2 yrs,No,Yes,HCIV,Retained,Non-Adherent,5
Kwera HCIII,Control,,Good,female,,Mid-Northern,<3 months,No,Yes,HCIII,Retained,Adherent,3
Kwera HCIII,Control,,Good,female,,Mid-Northern,Less than 1 yr,No,Yes,HCIII,Retained,Non-Adherent,3
Kwera HCIII,Control,,Good,male,,Mid-Northern,<3 months,No,Yes,HCIII,Retained,,3
Aduku HCIV,Control,,Good,female,,Mid-Northern,>2 yrs,No,No,HCIV,Retained,Adherent,5
Lumino HCIII,Control,,Good,male,20-49,Mid-Eastern,Less than 1 yr,Yes,No,HCIII,Retained,Adherent,7
Dokolo HCIV,Control,,,male,,Mid-Northern,1-2 yrs,No,Yes,HCIV,Retained,Adherent,5
Masafu General Hospital,Control,,,male,,Mid-Eastern,1-2 yrs,Yes,Yes,Hospital,Retained,Adherent,9
Kyazanga HCIV,Control,,Good,female,,Central 1 and 2,Less than 1 yr,Yes,Yes,HCIV,Retained,Adherent,2
Orum HCIV,Control,,Good,male,,Mid-Northern,1-2 yrs,No,Yes,HCIV,Retained,Adherent,5
Dokolo HCIV,Control,,,,,Mid-Northern,,No,Yes,HCIV,Retained,Non-Adherent,5
Kalagala HCIV,Control,,Good,female,20-49,Central 1 and 2,>2 yrs,No,Yes,HCIV,Retained,Adherent,10
Kitgum Hospital,Control,,Good,male,50+,Mid-Northern,>2 yrs,No,Yes,Hospital,Retained,Adherent,6
Bududa Hospital,Control,,Good,female,,Mid-Eastern,1-2 yrs,Yes,Yes,Hospital,Retained,Adherent,9
Namasale HCIII,Control,,,female,,Mid-Northern,>2 yrs,Yes,Yes,HCIII,Retained,Adherent,4
Madi Opei HCIV,Control,,Good,female,,Mid-Northern,>2 yrs,No,Yes,HCIV,Retained,Adherent,5
Kyazanga HCIV,Control,,Good,female,,Central 1 and 2,Less than 1 yr,No,Yes,HCIV,Retained,Adherent,2
Orum HCIV,Control,,Good,female,20-49,Mid-Northern,Less than 1 yr,No,No,HCIV,Retained,Non-Adherent,5
Kitgum Hospital,Control,,Good,female,,Mid-Northern,>2 yrs,No,No,Hospital,Retained,Adherent,6
Dokolo HCIV,Control,,,,<20,Mid-Northern,1-2 yrs,No,Yes,HCIV,Retained,Adherent,5
Dokolo HCIV,Control,,Good,male,,Mid-Northern,Less than 1 yr,No,No,HCIV,Retained,Adherent,5
Kyazanga HCIV,Control,,Good,female,,Central 1 and 2,Less than 1 yr,No,Yes,HCIV,Retained,Adherent,2
Agwatta HCIII,Control,,Good,male,,Mid-Northern,>2 yrs,Yes,Yes,HCIII,Retained,Adherent,3
Luweero HCIV,Control,,Good,male,,Central 1 and 2,Less than 1 yr,No,Yes,HCIV,Retained,Non-Adherent,2
Palabek-Kal HCIII,Control,,Good,male,,Mid-Northern,>2 yrs,No,Yes,HCIII,Retained,Adherent,3
Madi Opei HCIV,Control,,Good,male,50+,Mid-Northern,>2 yrs,No,Yes,HCIV,Retained,Adherent,5
Kyantungo HCIV,Control,,Good,female,,Central 1 and 2,>2 yrs,No,Yes,HCIV,Retained,Adherent,10
Kalagala HCIV,Control,,Good,female,20-49,Central 1 and 2,Less than 1 yr,No,No,HCIV,Retained,Non-Adherent,10
Agwatta HCIII,Control,,Good,,,Mid-Northern,Less than 1 yr,No,Yes,HCIII,Retained,Adherent,3
Kalagala HCIV,Control,,Good,male,20-49,Central 1 and 2,1-2 yrs,No,Yes,HCIV,Retained,Non-Adherent,10
Ogur HCIV,Control,,Good,male,,Mid-Northern,Less than 1 yr,Yes,Yes,HCIV,Retained,Non-Adherent,5
Lumino HCIII,Control,,,female,,Mid-Eastern,Less than 1 yr,Yes,No,HCIII,Retained,Non-Adherent,7
Atanga HCIII,Control,,Fair,female,20-49,Mid-Northern,1-2 yrs,No,No,HCIII,Retained,Adherent,4
Kalagala HCIV,Control,,,female,20-49,Central 1 and 2,1-2 yrs,Yes,Yes,HCIV,Retained,Adherent,10
Aduku HCIV,Control,,Good,male,20-49,Mid-Northern,1-2 yrs,No,No,HCIV,Retained,Non-Adherent,5
Kangai HCIII,Control,,Good,female,50+,Mid-Northern,1-2 yrs,No,No,HCIII,Retained,Non-Adherent,3
Bududa Hospital,Control,,,female,,Mid-Eastern,,No,Yes,Hospital,Retained,,9
Mwera HCIV,Control,,Good,male,20-49,Central 1 and 2,1-2 yrs,Yes,Yes,HCIV,Retained,Adherent,2
Palabek-Kal HCIII,Control,,Good,male,20-49,Mid-Northern,>2 yrs,No,Yes,HCIII,Retained,Adherent,3
Kitgum Hospital,Control,,Good,female,20-49,Mid-Northern,>2 yrs,No,Yes,Hospital,Retained,,6
Lumino HCIII,Control,,,female,20-49,Mid-Eastern,<3 months,No,Yes,HCIII,Retained,Adherent,7
Masafu General Hospital,Control,,Good,male,,Mid-Eastern,1-2 yrs,No,No,Hospital,Retained,Adherent,9
Kwera HCIII,Control,,Good,female,,Mid-Northern,>2 yrs,No,No,HCIII,Retained,Adherent,3
Namasale HCIII,Control,,Good,female,20-49,Mid-Northern,>2 yrs,No,Yes,HCIII,Retained,Adherent,4
Mwera HCIV,Control,,Good,female,20-49,Central 1 and 2,1-2 yrs,No,No,HCIV,Retained,Non-Adherent,2
Luweero HCIV,Control,,Good,female,,Central 1 and 2,>2 yrs,No,No,HCIV,Retained,Adherent,2
Aduku HCIV,Control,,Good,female,20-49,Mid-Northern,>2 yrs,No,No,HCIV,Retained,Non-Adherent,5
Namasale HCIII,Control,,Good,,,Mid-Northern,Less than 1 yr,No,Yes,HCIII,Retained,Adherent,4
Madi Opei HCIV,Control,,Good,female,,Mid-Northern,,Yes,No,HCIV,Retained,Adherent,5
Kwera HCIII,Control,,Good,female,,Mid-Northern,>2 yrs,Yes,Yes,HCIII,Retained,Adherent,3
Palabek-Kal HCIII,Control,,Good,female,,Mid-Northern,>2 yrs,No,Yes,HCIII,Retained,Adherent,3
Namasale HCIII,Control,,Good,female,20-49,Mid-Northern,>2 yrs,No,Yes,HCIII,Not Retained,Non-Adherent,4
Kyantungo HCIV,Control,,Good,male,50+,Central 1 and 2,1-2 yrs,No,No,HCIV,Retained,Non-Adherent,10
Kyazanga HCIV,Control,,Good,female,20-49,Central 1 and 2,>2 yrs,No,Yes,HCIV,Retained,Adherent,2
Aduku HCIV,Control,,Good,,50+,Mid-Northern,>2 yrs,No,No,HCIV,Retained,Non-Adherent,5
Kitgum Hospital,Control,,Good,female,,Mid-Northern,>2 yrs,No,No,Hospital,Retained,Adherent,6
Ngogwe HCIII,Control,,Good,male,20-49,Central 1 and 2,>2 yrs,No,Yes,HCIII,Retained,Non-Adherent,1
Luweero HCIV,Control,,Good,female,,Central 1 and 2,>2 yrs,No,Yes,HCIV,,Adherent,2
Kalagala HCIV,Control,,Good,male,,Central 1 and 2,>2 yrs,No,Yes,HCIV,Retained,Adherent,10
Masafu General Hospital,Control,,Good,female,,Mid-Eastern,>2 yrs,No,No,Hospital,Retained,Adherent,9
Lumino HCIII,Control,,Good,female,,Mid-Eastern,Less than 1 yr,No,Yes,HCIII,Retained,Adherent,7
Aduku HCIV,Control,,Good,female,20-49,Mid-Northern,Less than 1 yr,Yes,No,HCIV,Retained,Non-Adherent,5
Atanga HCIII,Control,,Good,female,,Mid-Northern,1-2 yrs,No,Yes,HCIII,Retained,Adherent,4
Kyantungo HCIV,Control,,Good,female,20-49,Central 1 and 2,>2 yrs,No,Yes,HCIV,Retained,Adherent,10
Madi Opei HCIV,Control,,Good,female,,Mid-Northern,>2 yrs,Yes,Yes,HCIV,Retained,Adherent,5
Atanga HCIII,Control,,Good,female,,Mid-Northern,1-2 yrs,No,Yes,HCIII,Retained,Adherent,4
Madi Opei HCIV,Control,,Good,female,,Mid-Northern,>2 yrs,No,Yes,HCIV,Retained,Adherent,5
Kalagala HCIV,Control,,Good,female,50+,Central 1 and 2,>2 yrs,No,Yes,HCIV,Retained,Adherent,10
Kangai HCIII,Control,,Good,female,,Mid-Northern,1-2 yrs,No,Yes,HCIII,Retained,,3
Luweero HCIV,Control,,Good,female,,Central 1 and 2,>2 yrs,No,Yes,HCIV,,,2
Kangai HCIII,Control,,,female,20-49,Mid-Northern,Less than 1 yr,No,Yes,HCIII,Retained,Non-Adherent,3
Kitgum Hospital,Control,,Good,female,,Mid-Northern,>2 yrs,No,Yes,Hospital,Retained,Adherent,6
Aduku HCIV,Control,,Good,female,,Mid-Northern,>2 yrs,No,Yes,HCIV,Retained,Adherent,5
Kwera HCIII,Control,,,female,,Mid-Northern,Less than 1 yr,No,Yes,HCIII,Retained,Adherent,3
Luweero HCIV,Control,,Good,male,,Central 1 and 2,>2 yrs,No,No,HCIV,Retained,Adherent,2
Mwera HCIV,Control,,Good,female,20-49,Central 1 and 2,>2 yrs,No,Yes,HCIV,Retained,Adherent,2
Kangai HCIII,Control,,,female,20-49,Mid-Northern,,No,Yes,HCIII,Retained,,3
Dokolo HCIV,Control,,,male,,Mid-Northern,Less than 1 yr,Yes,No,HCIV,Retained,Non-Adherent,5
Palabek-Kal HCIII,Control,,Good,male,,Mid-Northern,>2 yrs,No,Yes,HCIII,Retained,Adherent,3
Kyantungo HCIV,Control,,Good,,20-49,Central 1 and 2,<3 months,No,Yes,HCIV,Retained,Adherent,10
Lumino HCIII,Control,,,male,20-49,Mid-Eastern,,No,Yes,HCIII,Retained,Adherent,7
Aduku HCIV,Control,,Good,female,20-49,Mid-Northern,>2 yrs,No,Yes,HCIV,Retained,Non-Adherent,5
Dokolo HCIV,Control,,,male,20-49,Mid-Northern,>2 yrs,No,No,HCIV,Retained,Adherent,5
Luweero HCIV,Control,,Good,male,,Central 1 and 2,,No,No,HCIV,Retained,Adherent,2
Atanga HCIII,Control,,Good,female,,Mid-Northern,>2 yrs,No,Yes,HCIII,Retained,Non-Adherent,4
Mwera HCIV,Control,,Good,female,50+,Central 1 and 2,>2 yrs,No,No,HCIV,Retained,Non-Adherent,2
Namasale HCIII,Control,,Good,,,Mid-Northern,,Yes,No,HCIII,Retained,Adherent,4
Busia HCIV,Control,,Good,female,20-49,Mid-Eastern,>2 yrs,No,Yes,HCIV,Retained,Adherent,8
Lumino HCIII,Control,,Good,female,20-49,Mid-Eastern,,No,No,HCIII,Retained,Non-Adherent,7
Orum HCIV,Control,,Good,male,20-49,Mid-Northern,Less than 1 yr,Yes,No,HCIV,Retained,Non-Adherent,5
Kalagala HCIV,Control,,Good,female,,Central 1 and 2,Less than 1 yr,No,Yes,HCIV,Retained,Non-Adherent,10
Kwera HCIII,Control,,Good,male,,Mid-Northern,,No,No,HCIII,Retained,Adherent,3
Madi Opei HCIV,Control,,Good,male,,Mid-Northern,>2 yrs,No,Yes,HCIV,Retained,Adherent,5
Atanga HCIII,Control,,Good,female,,Mid-Northern,>2 yrs,No,No,HCIII,Retained,Adherent,4
Namasale HCIII,Control,,Good,male,50+,Mid-Northern,>2 yrs,Yes,Yes,HCIII,Retained,Adherent,4
Madi Opei HCIV,Control,,Good,male,,Mid-Northern,>2 yrs,No,Yes,HCIV,Retained,Adherent,5
Kyantungo HCIV,Control,,Good,female,50+,Central 1 and 2,>2 yrs,No,No,HCIV,Retained,Non-Adherent,10
Kyantungo HCIV,Control,,Good,male,50+,Central 1 and 2,,No,Yes,HCIV,Retained,Adherent,10
Dokolo HCIV,Control,,Good,female,20-49,Mid-Northern,1-2 yrs,No,Yes,HCIV,Retained,Adherent,5
Mwera HCIV,Control,,Good,female,20-49,Central 1 and 2,>2 yrs,Yes,No,HCIV,Retained,Non-Adherent,2
Bala HCIII,Control,,,male,,Mid-Northern,>2 yrs,No,Yes,HCIII,Retained,Non-Adherent,3
Namasale HCIII,Control,,Good,male,,Mid-Northern,1-2 yrs,No,Yes,HCIII,Retained,Adherent,4
Kangai HCIII,Control,,Good,female,20-49,Mid-Northern,Less than 1 yr,No,Yes,HCIII,Retained,,3
Madi Opei HCIV,Control,,Good,female,,Mid-Northern,>2 yrs,No,Yes,HCIV,Retained,Non-Adherent,5
Agwatta HCIII,Control,,Good,female,20-49,Mid-Northern,1-2 yrs,No,No,HCIII,Retained,Adherent,3
Ngogwe HCIII,Control,,Good,male,20-49,Central 1 and 2,>2 yrs,No,Yes,HCIII,Retained,Non-Adherent,1
Atanga HCIII,Control,,Fair,female,20-49,Mid-Northern,1-2 yrs,No,No,HCIII,Retained,Adherent,4
Kitgum Hospital,Control,,Good,female,20-49,Mid-Northern,>2 yrs,No,No,Hospital,Retained,Adherent,6
Kwera HCIII,Control,,,female,,Mid-Northern,<3 months,No,No,HCIII,Retained,Non-Adherent,3
Kyantungo HCIV,Control,,Good,female,50+,Central 1 and 2,1-2 yrs,No,Yes,HCIV,Retained,Non-Adherent,10
Ogur HCIV,Control,,Good,female,,Mid-Northern,1-2 yrs,Yes,Yes,HCIV,Not Retained,Non-Adherent,5
Madi Opei HCIV,Control,,Good,male,,Mid-Northern,>2 yrs,No,Yes,HCIV,Retained,Adherent,5
Palabek-Kal HCIII,Control,,Good,female,20-49,Mid-Northern,>2 yrs,No,Yes,HCIII,Retained,,3
Kwera HCIII,Control,,Good,female,,Mid-Northern,Less than 1 yr,No,Yes,HCIII,Retained,Non-Adherent,3
Madi Opei HCIV,Control,,Good,female,,Mid-Northern,>2 yrs,No,Yes,HCIV,Retained,Non-Adherent,5
Mwera HCIV,Control,,Poor,male,20-49,Central 1 and 2,1-2 yrs,Yes,Yes,HCIV,Retained,Non-Adherent,2
Palabek-Kal HCIII,Control,,Good,female,,Mid-Northern,>2 yrs,No,Yes,HCIII,Retained,Adherent,3
Kyazanga HCIV,Control,,Good,female,,Central 1 and 2,>2 yrs,No,Yes,HCIV,Retained,Non-Adherent,2
Kwera HCIII,Control,,Good,male,,Mid-Northern,1-2 yrs,No,Yes,HCIII,Retained,Adherent,3
Dokolo HCIV,Control,,Good,female,,Mid-Northern,,No,Yes,HCIV,Retained,Adherent,5
Kyazanga HCIV,Control,,Good,male,,Central 1 and 2,<3 months,Yes,Yes,HCIV,Retained,,2
Agwatta HCIII,Control,,Poor,male,,Mid-Northern,,No,No,HCIII,Retained,Non-Adherent,3
Kyantungo HCIV,Control,,Good,,20-49,Central 1 and 2,>2 yrs,Yes,Yes,HCIV,Retained,Adherent,10
Luweero HCIV,Control,,Good,female,,Central 1 and 2,Less than 1 yr,No,No,HCIV,Retained,Adherent,2
Madi Opei HCIV,Control,,Good,male,20-49,Mid-Northern,>2 yrs,Yes,No,HCIV,Retained,Non-Adherent,5
Kangai HCIII,Control,,,female,,Mid-Northern,1-2 yrs,No,Yes,HCIII,Retained,,3
Kangai HCIII,Control,,Good,female,,Mid-Northern,1-2 yrs,No,Yes,HCIII,Retained,,3
Kyazanga HCIV,Control,,,female,20-49,Central 1 and 2,<3 months,No,Yes,HCIV,Retained,,2
Bala HCIII,Control,,,male,20-49,Mid-Northern,Less than 1 yr,No,Yes,HCIII,Not Retained,Non-Adherent,3
Ngogwe HCIII,Control,,Good,male,20-49,Central 1 and 2,>2 yrs,Yes,Yes,HCIII,Retained,Adherent,1
Kwera HCIII,Control,,Poor,female,,Mid-Northern,>2 yrs,No,Yes,HCIII,Retained,,3
Aduku HCIV,Control,,Good,male,20-49,Mid-Northern,1-2 yrs,No,No,HCIV,Retained,Non-Adherent,5
Namasale HCIII,Control,,Good,male,50+,Mid-Northern,>2 yrs,Yes,Yes,HCIII,Retained,Non-Adherent,4
Masafu General Hospital,Control,,Good,,,Mid-Eastern,Less than 1 yr,No,Yes,Hospital,Retained,Adherent,9
Ngogwe HCIII,Control,,Good,male,20-49,Central 1 and 2,1-2 yrs,No,Yes,HCIII,Retained,Adherent,1
Lumino HCIII,Control,,Good,female,20-49,Mid-Eastern,>2 yrs,No,Yes,HCIII,Retained,Non-Adherent,7
Ogur HCIV,Control,,Good,female,,Mid-Northern,1-2 yrs,No,Yes,HCIV,Not Retained,Adherent,5
Lumino HCIII,Control,,Good,female,20-49,Mid-Eastern,Less than 1 yr,No,Yes,HCIII,Retained,Adherent,7
Kwera HCIII,Control,,,female,<20,Mid-Northern,Less than 1 yr,No,Yes,HCIII,Not Retained,,3
Ngogwe HCIII,Control,,Good,male,20-49,Central 1 and 2,>2 yrs,No,Yes,HCIII,Retained,Non-Adherent,1
Luweero HCIV,Control,,Good,male,,Central 1 and 2,Less than 1 yr,No,No,HCIV,Retained,Non-Adherent,2
Madi Opei HCIV,Control,,Good,female,,Mid-Northern,>2 yrs,No,Yes,HCIV,Retained,Adherent,5
Dokolo HCIV,Control,,Good,female,,Mid-Northern,>2 yrs,No,Yes,HCIV,Retained,Non-Adherent,5
Kyazanga HCIV,Control,,,female,,Central 1 and 2,<3 months,No,Yes,HCIV,Retained,,2
Kitgum Hospital,Control,,Good,female,20-49,Mid-Northern,>2 yrs,No,No,Hospital,Retained,Adherent,6
Masafu General Hospital,Control,,Good,male,,Mid-Eastern,>2 yrs,No,No,Hospital,Retained,Non-Adherent,9
Kitgum Hospital,Control,,Good,male,20-49,Mid-Northern,>2 yrs,No,No,Hospital,Retained,Adherent,6
Kangai HCIII,Control,,Good,female,,Mid-Northern,1-2 yrs,No,Yes,HCIII,Retained,Adherent,3
Luweero HCIV,Control,,Good,female,,Central 1 and 2,Less than 1 yr,Yes,Yes,HCIV,,Adherent,2
Mwera HCIV,Control,,Good,female,50+,Central 1 and 2,1-2 yrs,No,Yes,HCIV,Retained,Adherent,2
Atanga HCIII,Control,,Good,female,20-49,Mid-Northern,1-2 yrs,No,Yes,HCIII,Retained,Adherent,4
Kyantungo HCIV,Control,,Good,female,20-49,Central 1 and 2,Less than 1 yr,No,Yes,HCIV,Retained,Adherent,10
Namasale HCIII,Control,,Good,female,,Mid-Northern,Less than 1 yr,Yes,Yes,HCIII,Retained,Adherent,4
Palabek-Kal HCIII,Control,,Good,male,50+,Mid-Northern,>2 yrs,No,Yes,HCIII,Retained,Adherent,3
Ogur HCIV,Control,,Good,male,,Mid-Northern,Less than 1 yr,No,No,HCIV,Retained,Non-Adherent,5
Namasale HCIII,Control,,Good,,20-49,Mid-Northern,1-2 yrs,Yes,Yes,HCIII,Retained,Adherent,4
Lumino HCIII,Control,,,female,20-49,Mid-Eastern,,No,Yes,HCIII,Retained,Adherent,7
Busia HCIV,Control,,Good,female,,Mid-Eastern,1-2 yrs,No,Yes,HCIV,Retained,Non-Adherent,8
Mwera HCIV,Control,,Good,female,20-49,Central 1 and 2,1-2 yrs,No,Yes,HCIV,Retained,Adherent,2
Madi Opei HCIV,Control,,Good,female,20-49,Mid-Northern,>2 yrs,Yes,Yes,HCIV,Retained,Adherent,5
Palabek-Kal HCIII,Control,,Good,female,,Mid-Northern,>2 yrs,No,Yes,HCIII,Retained,Adherent,3
Agwatta HCIII,Control,,Good,female,,Mid-Northern,>2 yrs,Yes,No,HCIII,Retained,Adherent,3
Ngogwe HCIII,Control,,Good,female,20-49,Central 1 and 2,>2 yrs,No,Yes,HCIII,Retained,,1
Madi Opei HCIV,Control,,Good,female,,Mid-Northern,>2 yrs,No,Yes,HCIV,Retained,Adherent,5
Palabek-Kal HCIII,Control,,Good,female,,Mid-Northern,>2 yrs,No,Yes,HCIII,Retained,Adherent,3
Mwera HCIV,Control,,Good,male,20-49,Central 1 and 2,1-2 yrs,No,Yes,HCIV,Not Retained,Adherent,2
Atanga HCIII,Control,,,female,20-49,Mid-Northern,1-2 yrs,No,Yes,HCIII,Retained,Adherent,4
Ogur HCIV,Control,,Good,male,,Mid-Northern,>2 yrs,Yes,Yes,HCIV,Retained,Adherent,5
Orum HCIV,Control,,Good,male,,Mid-Northern,>2 yrs,Yes,Yes,HCIV,Retained,Adherent,5
Masafu General Hospital,Control,,Good,female,,Mid-Eastern,>2 yrs,No,Yes,Hospital,Retained,Non-Adherent,9
Masafu General Hospital,Control,,Good,female,,Mid-Eastern,>2 yrs,No,Yes,Hospital,Not Retained,,9
Madi Opei HCIV,Control,,Good,male,20-49,Mid-Northern,>2 yrs,No,Yes,HCIV,Retained,Adherent,5
Lumino HCIII,Control,,Good,male,,Mid-Eastern,1-2 yrs,No,Yes,HCIII,Retained,Adherent,7
Orum HCIV,Control,,Good,female,,Mid-Northern,>2 yrs,No,Yes,HCIV,Retained,Adherent,5
Kalagala HCIV,Control,,Good,male,,Central 1 and 2,1-2 yrs,No,Yes,HCIV,Retained,Adherent,10
Mwera HCIV,Control,,Good,female,20-49,Central 1 and 2,Less than 1 yr,No,Yes,HCIV,Retained,Adherent,2
Agwatta HCIII,Control,,Good,male,20-49,Mid-Northern,>2 yrs,No,Yes,HCIII,Retained,Adherent,3
Masafu General Hospital,Control,,Good,female,,Mid-Eastern,>2 yrs,No,Yes,Hospital,Retained,Adherent,9
Namasale HCIII,Control,,Good,,<20,Mid-Northern,Less than 1 yr,No,No,HCIII,Retained,Adherent,4
Kitgum Hospital,Control,,Good,female,20-49,Mid-Northern,>2 yrs,No,Yes,Hospital,Retained,Adherent,6
Namasale HCIII,Control,,Good,female,20-49,Mid-Northern,1-2 yrs,No,No,HCIII,Retained,Adherent,4
Madi Opei HCIV,Control,,Good,female,,Mid-Northern,>2 yrs,No,Yes,HCIV,Retained,Adherent,5
Kangai HCIII,Control,,,female,,Mid-Northern,Less than 1 yr,No,Yes,HCIII,Not Retained,,3
Madi Opei HCIV,Control,,Poor,female,,Mid-Northern,>2 yrs,No,Yes,HCIV,Retained,Non-Adherent,5
Ngogwe HCIII,Control,,Good,male,50+,Central 1 and 2,>2 yrs,No,Yes,HCIII,Retained,Adherent,1
Kalagala HCIV,Control,,,male,,Central 1 and 2,Less than 1 yr,Yes,Yes,HCIV,Retained,Adherent,10